http://linkedlifedata.com/resource/umls/id/C0001443
type: T114
type: T121
type: T124
type: Concept
has correlation: ANAT
has correlation: DISO
has correlation: PHYS
has correlation: PHEN
has correlation: PROC
has correlation: CONC
has correlation: CHEM
definition: MSH: A nucleoside that is composed of adenine and d-ribose. Adenosine or adenosine derivatives play many important biological roles in addition to being components of DNA and RNA. Adenosine itself is a neurotransmitter.,CSP: nucleoside that is composed of adenine and d-ribose; adenosine or adenosine derivatives play many important biological roles in addition to being components of DNA and RNA; adenosine itself is a neurotransmitter.,CHV: a kind of nucleic acid,NCI: A nucleoside that is composed of adenine and d-ribose. Adenosine or adenosine derivatives play many important biological roles in addition to being components of DNA and RNA. Adenosine itself is a neurotransmitter. (MeSH)
in scheme: umls
broader: http://linkedlifedata.com/resource/umls/id/C0003195
broader: http://linkedlifedata.com/resource/umls/id/C0042402
broader: http://linkedlifedata.com/resource/umls/id/C0027908
broader: http://linkedlifedata.com/resource/umls/id/C0002771
broader: http://linkedlifedata.com/resource/umls/id/C0034136
broader: http://linkedlifedata.com/resource/umls/id/C0035546
broader: http://linkedlifedata.com/resource/umls/id/C0596042
narrower: http://linkedlifedata.com/resource/umls/id/C0001465
narrower: http://linkedlifedata.com/resource/umls/id/C0036002
narrower: http://linkedlifedata.com/resource/umls/id/C0075456
narrower: http://linkedlifedata.com/resource/umls/id/C0219495
narrower: http://linkedlifedata.com/resource/umls/id/C1260028
narrower: http://linkedlifedata.com/resource/umls/id/C1999375
narrower: http://linkedlifedata.com/resource/umls/id/C2001298
narrower: http://linkedlifedata.com/resource/umls/id/C0648452
narrower: http://linkedlifedata.com/resource/umls/id/C2000234
narrower: http://linkedlifedata.com/resource/umls/id/C1450168
narrower: http://linkedlifedata.com/resource/umls/id/C2713965
narrower: http://linkedlifedata.com/resource/umls/id/C0649838
narrower: http://linkedlifedata.com/resource/umls/id/C1743682
narrower: http://linkedlifedata.com/resource/umls/id/C0637257
narrower: http://linkedlifedata.com/resource/umls/id/C0650980
narrower: http://linkedlifedata.com/resource/umls/id/C1741376
narrower: http://linkedlifedata.com/resource/umls/id/C2604557
narrower: http://linkedlifedata.com/resource/umls/id/C1957400
narrower: http://linkedlifedata.com/resource/umls/id/C1957497
narrower: http://linkedlifedata.com/resource/umls/id/C0252650
narrower: http://linkedlifedata.com/resource/umls/id/C1872527
narrower: http://linkedlifedata.com/resource/umls/id/C0043582
narrower: http://linkedlifedata.com/resource/umls/id/C0044076
narrower: http://linkedlifedata.com/resource/umls/id/C0044354
narrower: http://linkedlifedata.com/resource/umls/id/C0044462
narrower: http://linkedlifedata.com/resource/umls/id/C0045098
narrower: http://linkedlifedata.com/resource/umls/id/C0045125
narrower: http://linkedlifedata.com/resource/umls/id/C0045128
narrower: http://linkedlifedata.com/resource/umls/id/C0045226
narrower: http://linkedlifedata.com/resource/umls/id/C0045227
narrower: http://linkedlifedata.com/resource/umls/id/C0045714
narrower: http://linkedlifedata.com/resource/umls/id/C0045868
narrower: http://linkedlifedata.com/resource/umls/id/C0045917
narrower: http://linkedlifedata.com/resource/umls/id/C0046005
narrower: http://linkedlifedata.com/resource/umls/id/C0046111
narrower: http://linkedlifedata.com/resource/umls/id/C0046395
narrower: http://linkedlifedata.com/resource/umls/id/C0046518
narrower: http://linkedlifedata.com/resource/umls/id/C0046851
narrower: http://linkedlifedata.com/resource/umls/id/C0046852
narrower: http://linkedlifedata.com/resource/umls/id/C0047330
narrower: http://linkedlifedata.com/resource/umls/id/C0047335
narrower: http://linkedlifedata.com/resource/umls/id/C0047571
narrower: http://linkedlifedata.com/resource/umls/id/C0048785
narrower: http://linkedlifedata.com/resource/umls/id/C0048786
narrower: http://linkedlifedata.com/resource/umls/id/C0048824
narrower: http://linkedlifedata.com/resource/umls/id/C0048842
narrower: http://linkedlifedata.com/resource/umls/id/C0049988
narrower: http://linkedlifedata.com/resource/umls/id/C0050024
narrower: http://linkedlifedata.com/resource/umls/id/C0050028
narrower: http://linkedlifedata.com/resource/umls/id/C0050040
narrower: http://linkedlifedata.com/resource/umls/id/C0050054
narrower: http://linkedlifedata.com/resource/umls/id/C0050168
narrower: http://linkedlifedata.com/resource/umls/id/C0050169
narrower: http://linkedlifedata.com/resource/umls/id/C0050280
narrower: http://linkedlifedata.com/resource/umls/id/C0050334
narrower: http://linkedlifedata.com/resource/umls/id/C0050751
narrower: http://linkedlifedata.com/resource/umls/id/C0052371
narrower: http://linkedlifedata.com/resource/umls/id/C0052465
narrower: http://linkedlifedata.com/resource/umls/id/C0053210
narrower: http://linkedlifedata.com/resource/umls/id/C0061900