http://linkedlifedata.com/resource/umls/id/C0001175
type: T047
type: Concept
has correlation: LIVB
has correlation: ANAT
has correlation: DISO
has correlation: GENE
has correlation: PHYS
has correlation: PHEN
has correlation: ACTI
has correlation: PROC
has correlation: OBJC
has correlation: CONC
has correlation: OCCU
has correlation: ORGA
has correlation: CHEM
definition: MSH: An acquired defect of cellular immunity associated with infection by the human immunodeficiency virus (HIV), a CD4-positive T-lymphocyte count under 200 cells/microliter or less than 14% of total lymphocytes, and increased susceptibility to opportunistic infections and malignant neoplasms. Clinical manifestations also include emaciation (wasting) and dementia. These elements reflect criteria for AIDS as defined by the CDC in 1993.,CSP: one or more indicator diseases, depending on laboratory evidence of HIV infection (CDC); late phase of HIV infection characterized by marked suppression of immune function resulting in opportunistic infections, neoplasms, and other systemic symptoms (NIAID).,NCI: A disease caused by human immunodeficiency virus (HIV). People with acquired immunodeficiency syndrome are at an increased risk for developing certain cancers and for infections that usually occur only in individuals with a weak immune system.,NCI: A syndrome resulting from the acquired deficiency of cellular immu
in scheme: umls
broader: http://linkedlifedata.com/resource/umls/id/C0019693
broader: http://linkedlifedata.com/resource/umls/id/C0236104
broader: http://linkedlifedata.com/resource/umls/id/C0039082
narrower: http://linkedlifedata.com/resource/umls/id/C0237967
relation: R64592629
relation: R28410531
relation: R28483488
relation: R28483489
relation: R28483490
relation: R28483491
relation: R28483492
relation: R28483493
relation: R64592630
relation: R28410532
relation: R64578958
relation: R120179990
relation: R120179991
relation: R120179992
relation: R120179993
relation: R120179995
relation: R120179997
relation: R120179998
relation: R120179999
relation: R120180000
relation: R120180001
relation: R120180011
relation: R120180002
relation: R120180003
relation: R120180004
relation: R120180005
relation: R120180007
relation: R120180008
relation: R120180009
relation: R120180010
relation: R120180014
relation: R120180015
relation: R120180017
relation: R120180018
relation: R120180019
relation: R120180020
relation: R120180021
relation: R120180022
relation: R120180023
relation: R120180024
relation: R120180025
relation: R120180026
relation: R120180027
relation: R120180013
relation: R120179994
relation: R120180006
relation: R120180016
relation: R120179996
relation: R120180012
relation: R71044933
relation: R71089308
relation: R28384361
relation: R28384358
relation: R28384357
relation: R28384362
relation: R28384360
relation: R28384359
relation: R28384363
relation: R28384364