http://linkedlifedata.com/resource/umls/id/C0497327
type: T048
type: Concept
has correlation: LIVB
has correlation: ANAT
has correlation: DISO
has correlation: GENE
has correlation: PHYS
has correlation: PHEN
has correlation: ACTI
has correlation: PROC
has correlation: OBJC
has correlation: DEVI
has correlation: CONC
has correlation: OCCU
has correlation: ORGA
has correlation: CHEM
definition: MSH: An acquired organic mental disorder with loss of intellectual abilities of sufficient severity to interfere with social or occupational functioning. The dysfunction is multifaceted and involves memory, behavior, personality, judgment, attention, spatial relations, language, abstract thought, and other executive functions. The intellectual decline is usually progressive, and initially spares the level of consciousness.,MEDLINEPLUS: Dementia is a word for a group of symptoms caused by disorders that affect the brain. It is not a specific disease. People with dementia may not be able to think well enough to do normal activities, such as getting dressed or eating. They may lose their ability to solve problems or control their emotions. Their personalities may change. They may become agitated or see things that are not there. Memory loss is a common symptom of dementia. However, memory loss by itself does not mean you have dementia. People with dementia have serious problems with two or more brain f
in scheme: umls
broader: http://linkedlifedata.com/resource/umls/id/C0004936
broader: http://linkedlifedata.com/resource/umls/id/C0520473
narrower: http://linkedlifedata.com/resource/umls/id/C0338630
narrower: http://linkedlifedata.com/resource/umls/id/C0679298
narrower: http://linkedlifedata.com/resource/umls/id/C0751071
relation: R28492492
relation: R32100284
relation: R32100285
relation: R120256632
relation: R120256633
relation: R120256634
relation: R120256635
relation: R120256638
relation: R120256639
relation: R120256640
relation: R120256641
relation: R120256651
relation: R120256642
relation: R120256643
relation: R120256644
relation: R120256645
relation: R120256647
relation: R120256648
relation: R120256649
relation: R120256650
relation: R120256654
relation: R120256655
relation: R120256657
relation: R120256658
relation: R120256659
relation: R120256660
relation: R120256661
relation: R120256662
relation: R120256663
relation: R120256664
relation: R120256653
relation: R120256636
relation: R120256646
relation: R120256656
relation: R120256637
relation: R120256652
relation: R71401132
relation: R71076782
relation: R71178454
relation: R71228494
relation: R71344931
relation: R71058363
relation: R71178116
relation: R71229372
relation: R111775206
relation: R71294337
relation: R111775205
relation: R71199697
relation: R70987965
relation: R128803774
relation: R128803775
relation: R134635520
relation: R128803776
relation: R134635521
relation: R128803772
relation: R134635519
relation: R128803773