http://linkedlifedata.com/resource/umls/id/C0036341
type: T048
type: Concept
has correlation: ANAT
has correlation: DISO
has correlation: GENE
has correlation: PHYS
has correlation: PHEN
has correlation: ACTI
has correlation: PROC
has correlation: CONC
has correlation: CHEM
definition: MSH: A severe emotional disorder of psychotic depth characteristically marked by a retreat from reality with delusion formation, HALLUCINATIONS, emotional disharmony, and regressive behavior.,CSP: class of psychoses with disturbance mainly of cognition (content and form of thought, perception, sense of self versus external world, volition) and psychomotor function, rather than affect.,MEDLINEPLUS: Schizophrenia is a severe, lifelong brain disorder. People who have it may hear voices, see things that aren't there or believe that others are reading or controlling their minds. In men, symptoms usually start in the late teens and early 20s. They include hallucinations, or seeing things, and delusions such as hearing voices. For women, they start in the mid-20s to early 30s. Other symptoms include Unusual thoughts or perceptions Disorders of movement Difficulty speaking and expressing emotion Problems with attention, memory and organization No one is sure what
in scheme: umls
broader: http://linkedlifedata.com/resource/umls/id/C0033975
broader: http://linkedlifedata.com/resource/umls/id/C0349204
narrower: http://linkedlifedata.com/resource/umls/id/C0036344
narrower: http://linkedlifedata.com/resource/umls/id/C0036347
narrower: http://linkedlifedata.com/resource/umls/id/C0036349
narrower: http://linkedlifedata.com/resource/umls/id/C0023105
narrower: http://linkedlifedata.com/resource/umls/id/C0029838
narrower: http://linkedlifedata.com/resource/umls/id/C0036337
narrower: http://linkedlifedata.com/resource/umls/id/C0036351
narrower: http://linkedlifedata.com/resource/umls/id/C0221520
narrower: http://linkedlifedata.com/resource/umls/id/C0813173
relation: R28409208
relation: R28420111
relation: R28420178
relation: R28516257
relation: R120447954
relation: R120447955
relation: R120447956
relation: R120447957
relation: R120447960
relation: R120447961
relation: R120447962
relation: R120447963
relation: R120447973
relation: R120447964
relation: R120447965
relation: R120447966
relation: R120447967
relation: R120447969
relation: R120447970
relation: R120447971
relation: R120447972
relation: R120447976
relation: R120447977
relation: R120447978
relation: R120447979
relation: R120447980
relation: R120447981
relation: R120447982
relation: R120447983
relation: R120447984
relation: R120447985
relation: R120447975
relation: R120447958
relation: R120447968
relation: R120447959
relation: R120447974
relation: R71232418
relation: R71118778
relation: R71018541
relation: R71071517
relation: R71257592
relation: R101252381
relation: R71178163
relation: R71288742
relation: R71178164
relation: R28439293
relation: R28516264
relation: R28516265
relation: R28516266
relation: R64606861
relation: R00944767
relation: R03684488
relation: R03684489
relation: R03684490
relation: R03684491
relation: R03684492