http://linkedlifedata.com/resource/umls/id/C0030193
type: T184
type: Concept
has correlation: LIVB
has correlation: ANAT
has correlation: DISO
has correlation: PHYS
has correlation: PHEN
has correlation: ACTI
has correlation: PROC
has correlation: OBJC
has correlation: DEVI
has correlation: CONC
has correlation: OCCU
has correlation: ORGA
has correlation: CHEM
definition: MSH: An unpleasant sensation induced by noxious stimuli which are detected by NERVE ENDINGS of NOCICEPTIVE NEURONS.,CSP: unpleasant sensation induced by noxious stimuli and generally received by specialized nerve endings.,OMS: Unpleasant sensory and emotional experience associated with actual or potential tissue damage.,MEDLINEPLUS: Pain is a feeling triggered in the nervous system. Pain may be sharp or dull. It may come and go, or it may be constant. You may feel pain in one area of your body, such as your back, abdomen or chest or you may feel pain all over, such as when your muscles ache from the flu. Pain can be helpful in diagnosing a problem. Without pain, you might seriously hurt yourself without knowing it, or you might not realize you have a medical problem that needs treatment. Once you take care o
in scheme: umls
narrower: http://linkedlifedata.com/resource/umls/id/C0004604
narrower: http://linkedlifedata.com/resource/umls/id/C0018681
narrower: http://linkedlifedata.com/resource/umls/id/C0020429
narrower: http://linkedlifedata.com/resource/umls/id/C0178782
narrower: http://linkedlifedata.com/resource/umls/id/C0596240
narrower: http://linkedlifedata.com/resource/umls/id/C0234230
narrower: http://linkedlifedata.com/resource/umls/id/C0234238
narrower: http://linkedlifedata.com/resource/umls/id/C0234254
narrower: http://linkedlifedata.com/resource/umls/id/C0458257
narrower: http://linkedlifedata.com/resource/umls/id/C0458259
narrower: http://linkedlifedata.com/resource/umls/id/C0751407
narrower: http://linkedlifedata.com/resource/umls/id/C0751408
relation: R32105249
relation: R32105248
relation: R32105252
relation: R32105253
relation: R32105250
relation: R32105251
relation: R32105247
relation: R120396384
relation: R120396385
relation: R120396386
relation: R120396387
relation: R120396389
relation: R120396391
relation: R120396392
relation: R120396393
relation: R120396394
relation: R120396395
relation: R120396405
relation: R120396396
relation: R120396397
relation: R120396398
relation: R120396399
relation: R120396401
relation: R120396402
relation: R120396403
relation: R120396404
relation: R120396408
relation: R120396409
relation: R120396411
relation: R120396412
relation: R120396413
relation: R120396414
relation: R120396415
relation: R120396417
relation: R120396418
relation: R120396419
relation: R120396420
relation: R120396407
relation: R120396388
relation: R120396400
relation: R120396410
relation: R120396390
relation: R120396406
relation: R71231211
relation: R71074324
relation: R71282917
relation: R71007916
relation: R71011388
relation: R71358068
relation: R71233243
relation: R71353821