http://linkedlifedata.com/resource/umls/id/C0027651
type: T191
type: Concept
has correlation: LIVB
has correlation: ANAT
has correlation: DISO
has correlation: GENE
has correlation: PHYS
has correlation: PHEN
has correlation: PROC
has correlation: DEVI
has correlation: CONC
has correlation: OCCU
has correlation: CHEM
definition: MSH: New abnormal growth of tissue. Malignant neoplasms show a greater degree of anaplasia and have the properties of invasion and metastasis, compared to benign neoplasms.,NCI: An abnormal mass of tissue that results when cells divide more than they should or do not die when they should. Neoplasms may be benign (not cancer), or malignant (cancer).,NCI: A general term for autonomous tissue growth in which the malignancy status has not been established and for which the transformed cell type has not been specifically identified.,NCI: An abnormal tissue growth resulted from uncontrolled cell proliferation. Benign neoplastic cells resemble normal cells without exhibiting significant cytologic atypia, while malignant ones exhibit overt signs such as dysplastic features, atypical mitotic figures, necrosis, nuclear pleomorphism, and anaplasia. Representative examples of benign neoplasms include papillomas, cystadenomas, and lipomas; malignant neoplasms include carcinomas, sarcomas, lymphomas, and leukemias. -- 2004
in scheme: umls
broader: http://linkedlifedata.com/resource/umls/id/C0027671
narrower: http://linkedlifedata.com/resource/umls/id/C1261473
narrower: http://linkedlifedata.com/resource/umls/id/C0024299
narrower: http://linkedlifedata.com/resource/umls/id/C0023443
narrower: http://linkedlifedata.com/resource/umls/id/C0042133
narrower: http://linkedlifedata.com/resource/umls/id/C0042237
narrower: http://linkedlifedata.com/resource/umls/id/C0302592
narrower: http://linkedlifedata.com/resource/umls/id/C0023418
narrower: http://linkedlifedata.com/resource/umls/id/C0006826
narrower: http://linkedlifedata.com/resource/umls/id/C0153594
narrower: http://linkedlifedata.com/resource/umls/id/C0235653
narrower: http://linkedlifedata.com/resource/umls/id/C0027819
narrower: http://linkedlifedata.com/resource/umls/id/C0153633
narrower: http://linkedlifedata.com/resource/umls/id/C0153381
narrower: http://linkedlifedata.com/resource/umls/id/C0007114
narrower: http://linkedlifedata.com/resource/umls/id/C0025202
narrower: http://linkedlifedata.com/resource/umls/id/C0007115
narrower: http://linkedlifedata.com/resource/umls/id/C0345904
narrower: http://linkedlifedata.com/resource/umls/id/C0699791
narrower: http://linkedlifedata.com/resource/umls/id/C0026764
narrower: http://linkedlifedata.com/resource/umls/id/C0346647
narrower: http://linkedlifedata.com/resource/umls/id/C0684249
narrower: http://linkedlifedata.com/resource/umls/id/C0023798
narrower: http://linkedlifedata.com/resource/umls/id/C0023440
narrower: http://linkedlifedata.com/resource/umls/id/C0023448
narrower: http://linkedlifedata.com/resource/umls/id/C0023470
narrower: http://linkedlifedata.com/resource/umls/id/C0085669
narrower: http://linkedlifedata.com/resource/umls/id/C0235813
narrower: http://linkedlifedata.com/resource/umls/id/C1704327
narrower: http://linkedlifedata.com/resource/umls/id/C0206620
narrower: http://linkedlifedata.com/resource/umls/id/C0856897
narrower: http://linkedlifedata.com/resource/umls/id/C0006079
narrower: http://linkedlifedata.com/resource/umls/id/C0001418
narrower: http://linkedlifedata.com/resource/umls/id/C0007097
narrower: http://linkedlifedata.com/resource/umls/id/C0007113
narrower: http://linkedlifedata.com/resource/umls/id/C0007117
narrower: http://linkedlifedata.com/resource/umls/id/C0007121
narrower: http://linkedlifedata.com/resource/umls/id/C0007137
narrower: http://linkedlifedata.com/resource/umls/id/C0031511
narrower: http://linkedlifedata.com/resource/umls/id/C0151468
narrower: http://linkedlifedata.com/resource/umls/id/C0152018
narrower: http://linkedlifedata.com/resource/umls/id/C0154069
narrower: http://linkedlifedata.com/resource/umls/id/C0205699
narrower: http://linkedlifedata.com/resource/umls/id/C0206667
narrower: http://linkedlifedata.com/resource/umls/id/C0235754
narrower: http://linkedlifedata.com/resource/umls/id/C0235782
narrower: http://linkedlifedata.com/resource/umls/id/C0235974
narrower: http://linkedlifedata.com/resource/umls/id/C0549473
narrower: http://linkedlifedata.com/resource/umls/id/C0699790
narrower: http://linkedlifedata.com/resource/umls/id/C0699885
narrower: http://linkedlifedata.com/resource/umls/id/C0699893
narrower: http://linkedlifedata.com/resource/umls/id/C0740277
narrower: http://linkedlifedata.com/resource/umls/id/C0851140
narrower: http://linkedlifedata.com/resource/umls/id/C1153706
narrower: http://linkedlifedata.com/resource/umls/id/C1378703
narrower: http://linkedlifedata.com/resource/umls/id/C2239176
narrower: http://linkedlifedata.com/resource/umls/id/C0024305
narrower: http://linkedlifedata.com/resource/umls/id/C0026948
narrower: http://linkedlifedata.com/resource/umls/id/C0497538
narrower: http://linkedlifedata.com/resource/umls/id/C0023267
narrower: http://linkedlifedata.com/resource/umls/id/C0153474
narrower: http://linkedlifedata.com/resource/umls/id/C1377913
narrower: http://linkedlifedata.com/resource/umls/id/C0029440
narrower: http://linkedlifedata.com/resource/umls/id/C0004114
narrower: http://linkedlifedata.com/resource/umls/id/C0035335