http://linkedlifedata.com/resource/umls/id/C0023418
type: T191
type: Concept
has correlation: LIVB
has correlation: ANAT
has correlation: DISO
has correlation: GENE
has correlation: PHEN
has correlation: PROC
has correlation: DEVI
has correlation: CONC
has correlation: CHEM
definition: MSH: A progressive, malignant disease of the blood-forming organs, characterized by distorted proliferation and development of leukocytes and their precursors in the blood and bone marrow. Leukemias were originally termed acute or chronic based on life expectancy but now are classified according to cellular maturity. Acute leukemias consist of predominately immature cells; chronic leukemias are composed of more mature cells. (From The Merck Manual, 2006),CSP: progressive, malignant disease of the blood-forming organs, characterized by distorted proliferation and development of leukocytes and their precursors in the blood and bone marrow; classified according to degree of cell differentiation as acute or chronic, and according to predominant type of cell involved as myelogenous or lymphocytic.,NCI: Cancer that starts in blood-forming tissue such as the bone marrow and causes large numbers of blood cells to be produced and enter the bloodstream.,MEDLINEPLUS: Leukemia is cancer of the white blood cells. White
in scheme: umls
broader: http://linkedlifedata.com/resource/umls/id/C0027651
broader: http://linkedlifedata.com/resource/umls/id/C0178516
narrower: http://linkedlifedata.com/resource/umls/id/C0023443
narrower: http://linkedlifedata.com/resource/umls/id/C0023488
narrower: http://linkedlifedata.com/resource/umls/id/C0023440
narrower: http://linkedlifedata.com/resource/umls/id/C0023448
narrower: http://linkedlifedata.com/resource/umls/id/C0023465
narrower: http://linkedlifedata.com/resource/umls/id/C0023470
narrower: http://linkedlifedata.com/resource/umls/id/C0023484
narrower: http://linkedlifedata.com/resource/umls/id/C0085669
narrower: http://linkedlifedata.com/resource/umls/id/C1279296
narrower: http://linkedlifedata.com/resource/umls/id/C0598894
narrower: http://linkedlifedata.com/resource/umls/id/C0596978
narrower: http://linkedlifedata.com/resource/umls/id/C0597646
relation: R05300637
relation: R44102382
relation: R44102383
relation: R05301925
relation: R111921082
relation: R111874794
relation: R111874796
relation: R111874787
relation: R111874789
relation: R111874786
relation: R111874785
relation: R111874841
relation: R111874842
relation: R111874790
relation: R111874792
relation: R111874843
relation: R111874784
relation: R111874795
relation: R111874788
relation: R111874791
relation: R111874793
relation: R111874833
relation: R111874810
relation: R111874797
relation: R111874823
relation: R111874798
relation: R134157333
relation: R134157335
relation: R134157337
relation: R134157339
relation: R134157341
relation: R134157343
relation: R134157345
relation: R134157347
relation: R134157351
relation: R134157355
relation: R134157359
relation: R134157363
relation: R134157367
relation: R134157375
relation: R134129299
relation: R134129303
relation: R134129307
relation: R134129311
relation: R134129319
relation: R134129323
relation: R134129327
relation: R111874825
relation: R134129331
relation: R134129339
relation: R134129343
relation: R134129347
relation: R134129351