http://linkedlifedata.com/resource/umls/id/C0023175
type: T131
type: T196
type: Concept
has correlation: ANAT
has correlation: DISO
has correlation: PHYS
has correlation: PROC
has correlation: OBJC
has correlation: DEVI
has correlation: CONC
has correlation: CHEM
definition: MSH: A soft, grayish metal with poisonous salts; atomic number 82, atomic weight 207.19, symbol Pb. (Dorland, 28th),CSP: soft grayish blue metal with poisonous salts; symbol, Pb, atomic number 82.,NCI: An element with atomic symbol Pb, atomic number 82, and atomic weight 207.2.,CHV: metal,CHV: metal,CHV: metal
in scheme: umls
broader: http://linkedlifedata.com/resource/umls/id/C0347988
broader: http://linkedlifedata.com/resource/umls/id/C0682903
narrower: http://linkedlifedata.com/resource/umls/id/C0064717
narrower: http://linkedlifedata.com/resource/umls/id/C0303232
narrower: http://linkedlifedata.com/resource/umls/id/C0064720
narrower: http://linkedlifedata.com/resource/umls/id/C0064725
narrower: http://linkedlifedata.com/resource/umls/id/C0064716
narrower: http://linkedlifedata.com/resource/umls/id/C0642346
narrower: http://linkedlifedata.com/resource/umls/id/C0064719
narrower: http://linkedlifedata.com/resource/umls/id/C0064713
narrower: http://linkedlifedata.com/resource/umls/id/C0064722
narrower: http://linkedlifedata.com/resource/umls/id/C0163723
narrower: http://linkedlifedata.com/resource/umls/id/C0607496
narrower: http://linkedlifedata.com/resource/umls/id/C0623827
relation: R112875450
relation: R120346792
relation: R120346793
relation: R120346796
relation: R120346797
relation: R120346798
relation: R120346800
relation: R120346801
relation: R120346802
relation: R120346804
relation: R120346805
relation: R120346806
relation: R120346808
relation: R120346809
relation: R120346810
relation: R120346811
relation: R120346812
relation: R120346813
relation: R120346814
relation: R120346815
relation: R120346816
relation: R120346817
relation: R120346803
relation: R120346794
relation: R120346807
relation: R120346799
relation: R71099774
relation: R128855927
relation: R128855935
relation: R128855932
relation: R128855926
relation: R128855928
relation: R128855921
relation: R128855936
relation: R128855931
relation: R128855930
relation: R128855923
relation: R128855925
relation: R128855941
relation: R128855929
relation: R128855943
relation: R128855933
relation: R128855937
relation: R128855942
relation: R128855922
relation: R128855924
relation: R128855934
relation: R128855938
relation: R128855939
relation: R128855940
relation: R128855944
relation: R128855945
relation: R128855946