http://linkedlifedata.com/resource/umls/id/C0021311
type: T047
type: Concept
has correlation: LIVB
has correlation: ANAT
has correlation: DISO
has correlation: PHYS
has correlation: PHEN
has correlation: ACTI
has correlation: PROC
has correlation: DEVI
has correlation: CONC
has correlation: CHEM
definition: MSH: Invasion of the host organism by microorganisms that can cause pathological conditions or diseases.,CSP: invasion and growth of microorganisms in body tissues, which may be clinically inapparent or result in local cellular injury; a local infection may persist and spread by extension to become an acute, subacute, or chronic clinical infection or disease state or it may become systemic when the microorganisms gain access to the lymphatic or vascular system; does not always lead to injury of the host even if the pathogen is potentially virulent.,CCC: Contamination with disease-producing germs
in scheme: umls
broader: http://linkedlifedata.com/resource/umls/id/C0012634
broader: http://linkedlifedata.com/resource/umls/id/C0236104
narrower: http://linkedlifedata.com/resource/umls/id/C0009450
narrower: http://linkedlifedata.com/resource/umls/id/C0032965
narrower: http://linkedlifedata.com/resource/umls/id/C0038395
narrower: http://linkedlifedata.com/resource/umls/id/C0042029
narrower: http://linkedlifedata.com/resource/umls/id/C0035243
narrower: http://linkedlifedata.com/resource/umls/id/C0029118
narrower: http://linkedlifedata.com/resource/umls/id/C1264613
narrower: http://linkedlifedata.com/resource/umls/id/C0699744
narrower: http://linkedlifedata.com/resource/umls/id/C0034041
narrower: http://linkedlifedata.com/resource/umls/id/C0037278
narrower: http://linkedlifedata.com/resource/umls/id/C0205721
narrower: http://linkedlifedata.com/resource/umls/id/C2242472
narrower: http://linkedlifedata.com/resource/umls/id/C0015403
narrower: http://linkedlifedata.com/resource/umls/id/C1112211
narrower: http://linkedlifedata.com/resource/umls/id/C0597039
narrower: http://linkedlifedata.com/resource/umls/id/C0016397
narrower: http://linkedlifedata.com/resource/umls/id/C0596270
narrower: http://linkedlifedata.com/resource/umls/id/C0275544
narrower: http://linkedlifedata.com/resource/umls/id/C0442886
narrower: http://linkedlifedata.com/resource/umls/id/C1171315
relation: R28501857
relation: R64585483
relation: R120334123
relation: R120334124
relation: R120334125
relation: R120334126
relation: R120334128
relation: R120334130
relation: R120334131
relation: R120334132
relation: R120334133
relation: R120334134
relation: R120334144
relation: R120334135
relation: R120334136
relation: R120334137
relation: R120334138
relation: R120334140
relation: R120334141
relation: R120334142
relation: R120334143
relation: R120334147
relation: R120334149
relation: R120334150
relation: R120334151
relation: R120334152
relation: R120334153
relation: R120334154
relation: R120334155
relation: R120334156
relation: R120334157
relation: R120334158
relation: R120334159
relation: R120334146
relation: R120334127
relation: R120334139
relation: R120334148
relation: R120334129
relation: R120334145
relation: R71023268
relation: R71289255
relation: R71017287
relation: R71010570
relation: R71336161