http://linkedlifedata.com/resource/umls/id/C0017337
type: T028
type: Concept
has correlation: ANAT
has correlation: DISO
has correlation: GENE
has correlation: PHYS
has correlation: PHEN
has correlation: PROC
has correlation: CONC
has correlation: OCCU
has correlation: CHEM
definition: MSH: A category of nucleic acid sequences that function as units of heredity and which code for the basic instructions for the development, reproduction, and maintenance of organisms.,CSP: segment of the genome that codes for a functional product.,NCI: The functional and physical unit of heredity passed from parent to offspring. Genes are pieces of DNA, and most genes contain the information for making a specific protein.,HL7V3.0: Description:A DNA segment that contributes to phenotype/function. In the absence of demonstrated function a gene may be characterized by sequence, transcription or homology ,NCI: A functional unit of heredity which occupies a specific position on a particular chromosome and serves as the template for a product that contributes to a phenotype or a biological function.
in scheme: umls
narrower: http://linkedlifedata.com/resource/umls/id/C1533585
narrower: http://linkedlifedata.com/resource/umls/id/C0029016
narrower: http://linkedlifedata.com/resource/umls/id/C0079427
narrower: http://linkedlifedata.com/resource/umls/id/C0017366
narrower: http://linkedlifedata.com/resource/umls/id/C0597336
narrower: http://linkedlifedata.com/resource/umls/id/C1537074
narrower: http://linkedlifedata.com/resource/umls/id/C0678941
narrower: http://linkedlifedata.com/resource/umls/id/C0002085
narrower: http://linkedlifedata.com/resource/umls/id/C0017342
narrower: http://linkedlifedata.com/resource/umls/id/C0017354
narrower: http://linkedlifedata.com/resource/umls/id/C0017361
narrower: http://linkedlifedata.com/resource/umls/id/C0029073
narrower: http://linkedlifedata.com/resource/umls/id/C0033713
narrower: http://linkedlifedata.com/resource/umls/id/C0178868
narrower: http://linkedlifedata.com/resource/umls/id/C0314614
narrower: http://linkedlifedata.com/resource/umls/id/C0596707
narrower: http://linkedlifedata.com/resource/umls/id/C0814035
narrower: http://linkedlifedata.com/resource/umls/id/C0440471
relation: R32101950
relation: R44811171
relation: R120301666
relation: R120301668
relation: R120301669
relation: R120301665
relation: R120301667
relation: R71194200
relation: R71191360
relation: R71396230
relation: R71132998
relation: R71025326
relation: R71234480
relation: R71124746
relation: R71181304
relation: R71337916
relation: R71301894
relation: R71084097
relation: R71138072
relation: R71336863
relation: R71079271
relation: R71178928
relation: R71191135
relation: R71350907
relation: R71027257
relation: R71408489
relation: R71185159
relation: R71352586
relation: R71008207
relation: R71019255
relation: R71080874
relation: R71302109
relation: R71304040
relation: R71081392
relation: R71346442
relation: R71120928
relation: R71356525
relation: R100035401
relation: R100035402
relation: R71023944
relation: R71131617
relation: R71243216
relation: R71281812
relation: R129106241
relation: R129106242
relation: R71329979
relation: R28387375
relation: R44810888
relation: R28387376