http://linkedlifedata.com/resource/umls/id/C0003232
type: T195
type: Concept
has correlation: LIVB
has correlation: DISO
has correlation: PHYS
has correlation: PHEN
has correlation: PROC
has correlation: OBJC
has correlation: DEVI
has correlation: CONC
has correlation: CHEM
definition: CSP: substances produced by microorganisms or biomimetics that can inhibit or suppress the growth of other microorganisms; frequently used without reference to the microbial origins of the original substance.,MEDLINEPLUS: Antibiotics are powerful medicines that fight bacterial infections. Used properly, antibiotics can save lives. They either kill bacteria or keep them from reproducing. Your body's natural defenses can usually take it from there. Antibiotics do not fight infections caused by viruses, such as Colds Flu Most coughs and bronchitis Sore throats, unless caused by strep If a virus is making you sick, taking antibiotics may do more harm than good. Each time you take antibiotics, you increase the chances that bacteria in your body will be able to resist them. Later, you could get or spread an infection that those antibiotics cannot cure. When you take antib
in scheme: umls
narrower: http://linkedlifedata.com/resource/umls/id/C0003236
narrower: http://linkedlifedata.com/resource/umls/id/C0003237
narrower: http://linkedlifedata.com/resource/umls/id/C0004599
narrower: http://linkedlifedata.com/resource/umls/id/C0008168
narrower: http://linkedlifedata.com/resource/umls/id/C0018165
narrower: http://linkedlifedata.com/resource/umls/id/C0026458
narrower: http://linkedlifedata.com/resource/umls/id/C0027783
narrower: http://linkedlifedata.com/resource/umls/id/C0028458
narrower: http://linkedlifedata.com/resource/umls/id/C0035609
narrower: http://linkedlifedata.com/resource/umls/id/C0035654
narrower: http://linkedlifedata.com/resource/umls/id/C0042313
narrower: http://linkedlifedata.com/resource/umls/id/C0054036
narrower: http://linkedlifedata.com/resource/umls/id/C0003240
narrower: http://linkedlifedata.com/resource/umls/id/C0003235
narrower: http://linkedlifedata.com/resource/umls/id/C1744619
narrower: http://linkedlifedata.com/resource/umls/id/C0003233
narrower: http://linkedlifedata.com/resource/umls/id/C0003238
relation: R05660879
relation: R05660880
relation: R05660881
relation: R05660884
relation: R05660882
relation: R05660885
relation: R05660886
relation: R05660888
relation: R05660889
relation: R05660883
relation: R05660890
relation: R05660891
relation: R05660878
relation: R05660896
relation: R05660893
relation: R05660876
relation: R05660877
relation: R05660875
relation: R05660895
relation: R05670932
relation: R00891912
relation: R00904253
relation: R00904254
relation: R00904255
relation: R00904258
relation: R00904256
relation: R00904259
relation: R00904260
relation: R00904262
relation: R00904263
relation: R00904257
relation: R00904264
relation: R00904265
relation: R00904252
relation: R00904270
relation: R00904267
relation: R00904250
relation: R00904251
relation: R00904249
relation: R00904269
relation: R00912773
relation: R00912772
relation: R48838409
relation: R00912774
relation: R43985836
relation: R43985845
relation: R43985837
relation: R43985838
relation: R43985839
relation: R43985834