http://linkedlifedata.com/resource/umls/id/C0043481
type: T121
type: T123
type: T196
type: Concept
has correlation: ANAT
has correlation: DISO
has correlation: PHYS
has correlation: PROC
has correlation: OBJC
has correlation: CONC
has correlation: CHEM
definition: MSH: A metallic element of atomic number 30 and atomic weight 65.38. It is a necessary trace element in the diet, forming an essential part of many enzymes, and playing an important role in protein synthesis and in cell division. Zinc deficiency is associated with ANEMIA, short stature, HYPOGONADISM, impaired WOUND HEALING, and geophagia. It is known by the symbol Zn.,CSP: metallic trace element, atomic symbol Zn, atomic number 30; necessary in the diet, forms an essential part of many enzymes, and plays an important role in protein synthesis and in cell division.,NCI: An element with atomic symbol Zn, atomic number 30, and atomic weight 65.39.
in scheme: umls
broader: http://linkedlifedata.com/resource/umls/id/C0040577
broader: http://linkedlifedata.com/resource/umls/id/C0347988
broader: http://linkedlifedata.com/resource/umls/id/C0682901
narrower: http://linkedlifedata.com/resource/umls/id/C1098208
narrower: http://linkedlifedata.com/resource/umls/id/C0168052
narrower: http://linkedlifedata.com/resource/umls/id/C0389587
narrower: http://linkedlifedata.com/resource/umls/id/C1170431
narrower: http://linkedlifedata.com/resource/umls/id/C0609871
narrower: http://linkedlifedata.com/resource/umls/id/C0172629
narrower: http://linkedlifedata.com/resource/umls/id/C2973934
narrower: http://linkedlifedata.com/resource/umls/id/C2974602
narrower: http://linkedlifedata.com/resource/umls/id/C3253952
relation: R112875817
relation: R120501647
relation: R120501648
relation: R120501651
relation: R120501652
relation: R120501653
relation: R120501655
relation: R120501656
relation: R120501657
relation: R120501659
relation: R120501660
relation: R120501661
relation: R120501663
relation: R120501664
relation: R120501665
relation: R120501666
relation: R120501667
relation: R120501668
relation: R120501669
relation: R120501670
relation: R120501671
relation: R120501672
relation: R120501673
relation: R120501658
relation: R120501649
relation: R120501662
relation: R120501654
relation: R70976951
relation: R71165561
relation: R44717394
relation: R128967928
relation: R128967929
relation: R128967938
relation: R128967931
relation: R128967927
relation: R128967932
relation: R128967933
relation: R128967936
relation: R128967934
relation: R128967935
relation: R128967937
relation: R128967939
relation: R128967930
relation: R131174494
relation: R134639676
relation: R28391902
relation: R28391903
relation: R130960437
relation: R71405906
relation: R71240698
relation: R71074812
relation: R71350521
relation: R71075370
relation: R71184720
relation: R71020152