http://linkedlifedata.com/resource/umls/id/C0042769
type: T047
type: Concept
has correlation: LIVB
has correlation: ANAT
has correlation: DISO
has correlation: GENE
has correlation: PHYS
has correlation: PHEN
has correlation: PROC
has correlation: OBJC
has correlation: CONC
has correlation: OCCU
has correlation: ORGA
has correlation: CHEM
definition: MSH: A general term for diseases produced by viruses.,CSP: disease produced by viruses.,MEDLINEPLUS: Viruses are capsules with genetic material inside. They are very tiny, much smaller than bacteria. Viruses cause familiar infectious diseases such as the common cold, flu and warts. They also cause severe illnesses such as HIV/AIDS, smallpox and hemorrhagic fevers. Viruses are like hijackers. They invade living, normal cells and use those cells to multiply and produce other viruses like themselves. This eventually kills the cells, which can make you sick. Viral infections are hard to treat because viruses live inside your
in scheme: umls
broader: http://linkedlifedata.com/resource/umls/id/C0009450
broader: http://linkedlifedata.com/resource/umls/id/C0236104
narrower: http://linkedlifedata.com/resource/umls/id/C0025297
narrower: http://linkedlifedata.com/resource/umls/id/C0042721
narrower: http://linkedlifedata.com/resource/umls/id/C0019104
narrower: http://linkedlifedata.com/resource/umls/id/C0009443
narrower: http://linkedlifedata.com/resource/umls/id/C0597655
narrower: http://linkedlifedata.com/resource/umls/id/C0015674
narrower: http://linkedlifedata.com/resource/umls/id/C0021345
narrower: http://linkedlifedata.com/resource/umls/id/C0032310
narrower: http://linkedlifedata.com/resource/umls/id/C0019159
narrower: http://linkedlifedata.com/resource/umls/id/C0019372
narrower: http://linkedlifedata.com/resource/umls/id/C0025007
narrower: http://linkedlifedata.com/resource/umls/id/C0026780
narrower: http://linkedlifedata.com/resource/umls/id/C0034494
narrower: http://linkedlifedata.com/resource/umls/id/C0035920
narrower: http://linkedlifedata.com/resource/umls/id/C1175175
narrower: http://linkedlifedata.com/resource/umls/id/C0029342
narrower: http://linkedlifedata.com/resource/umls/id/C0032870
narrower: http://linkedlifedata.com/resource/umls/id/C0035112
narrower: http://linkedlifedata.com/resource/umls/id/C0032371
narrower: http://linkedlifedata.com/resource/umls/id/C0206613
narrower: http://linkedlifedata.com/resource/umls/id/C0035369
narrower: http://linkedlifedata.com/resource/umls/id/C0040361
narrower: http://linkedlifedata.com/resource/umls/id/C0597648
narrower: http://linkedlifedata.com/resource/umls/id/C1321909
narrower: http://linkedlifedata.com/resource/umls/id/C2930924
relation: R05299513
relation: R05299514
relation: R05299515
relation: R05300629
relation: R05301888
relation: R05301887
relation: R44102377
relation: R05301889
relation: R111874642
relation: R111874621
relation: R111874693
relation: R111874694
relation: R111874684
relation: R111874615
relation: R111874644
relation: R111874695
relation: R111874622
relation: R134153347
relation: R111874685
relation: R111874612
relation: R111874687
relation: R111874618
relation: R111874637
relation: R111874716
relation: R111874640
relation: R111874613
relation: R111874623
relation: R111874696
relation: R134153337
relation: R111874627
relation: R111874617
relation: R111874688
relation: R134153341
relation: R111874614
relation: R111874706
relation: R111874690
relation: R111874700