http://linkedlifedata.com/resource/umls/id/C0037663
type: T116
type: T121
type: T125
type: Concept
has correlation: ANAT
has correlation: DISO
has correlation: GENE
has correlation: PHYS
has correlation: PHEN
has correlation: PROC
has correlation: CONC
has correlation: CHEM
definition: MSH: A polypeptide that is secreted by the adenohypophysis (PITUITARY GLAND, ANTERIOR). Growth hormone, also known as somatotropin, stimulates mitosis, cell differentiation and cell growth. Species-specific growth hormones have been synthesized.,CSP: polypeptide that is secreted by the anterior pituitary gland; affects protein, carbohydrate and lipid metabolism; stimulates mitosis, cell differentiation and cell growth.,NCI: A protein made by the pituitary gland that helps control body growth and the use of glucose and fat in the body.,NCI: A peptide hormone secreted by the anterior lobe of the pituitary gland and regulates several physiologic processes, including growth and metabolism.
in scheme: umls
broader: http://linkedlifedata.com/resource/umls/id/C0019932
broader: http://linkedlifedata.com/resource/umls/id/C0032015
broader: http://linkedlifedata.com/resource/umls/id/C0032016
broader: http://linkedlifedata.com/resource/umls/id/C0815047
broader: http://linkedlifedata.com/resource/umls/id/C0312439
narrower: http://linkedlifedata.com/resource/umls/id/C1437388
narrower: http://linkedlifedata.com/resource/umls/id/C0084063
narrower: http://linkedlifedata.com/resource/umls/id/C0609324
narrower: http://linkedlifedata.com/resource/umls/id/C0376560
narrower: http://linkedlifedata.com/resource/umls/id/C0521959
narrower: http://linkedlifedata.com/resource/umls/id/C2354863
narrower: http://linkedlifedata.com/resource/umls/id/C0050397
narrower: http://linkedlifedata.com/resource/umls/id/C0054852
narrower: http://linkedlifedata.com/resource/umls/id/C0063012
narrower: http://linkedlifedata.com/resource/umls/id/C0063013
narrower: http://linkedlifedata.com/resource/umls/id/C0067251
narrower: http://linkedlifedata.com/resource/umls/id/C0074861
narrower: http://linkedlifedata.com/resource/umls/id/C0074862
narrower: http://linkedlifedata.com/resource/umls/id/C0074863
narrower: http://linkedlifedata.com/resource/umls/id/C0074865
narrower: http://linkedlifedata.com/resource/umls/id/C0074866
narrower: http://linkedlifedata.com/resource/umls/id/C0074867
narrower: http://linkedlifedata.com/resource/umls/id/C0074868
narrower: http://linkedlifedata.com/resource/umls/id/C0074869
narrower: http://linkedlifedata.com/resource/umls/id/C0074871
narrower: http://linkedlifedata.com/resource/umls/id/C0219780
narrower: http://linkedlifedata.com/resource/umls/id/C0255308
narrower: http://linkedlifedata.com/resource/umls/id/C0299207
narrower: http://linkedlifedata.com/resource/umls/id/C0614468
narrower: http://linkedlifedata.com/resource/umls/id/C0614931
narrower: http://linkedlifedata.com/resource/umls/id/C0614934
narrower: http://linkedlifedata.com/resource/umls/id/C0616690
narrower: http://linkedlifedata.com/resource/umls/id/C0633282
narrower: http://linkedlifedata.com/resource/umls/id/C0634110
narrower: http://linkedlifedata.com/resource/umls/id/C0648600
narrower: http://linkedlifedata.com/resource/umls/id/C0648847
narrower: http://linkedlifedata.com/resource/umls/id/C0650352
narrower: http://linkedlifedata.com/resource/umls/id/C0652967
narrower: http://linkedlifedata.com/resource/umls/id/C0657251
narrower: http://linkedlifedata.com/resource/umls/id/C0657254
narrower: http://linkedlifedata.com/resource/umls/id/C0661972
narrower: http://linkedlifedata.com/resource/umls/id/C0665700
narrower: http://linkedlifedata.com/resource/umls/id/C0071873
narrower: http://linkedlifedata.com/resource/umls/id/C0520986
narrower: http://linkedlifedata.com/resource/umls/id/C1447366
narrower: http://linkedlifedata.com/resource/umls/id/C0056720
narrower: http://linkedlifedata.com/resource/umls/id/C0073862
narrower: http://linkedlifedata.com/resource/umls/id/C0073867
narrower: http://linkedlifedata.com/resource/umls/id/C0074893
narrower: http://linkedlifedata.com/resource/umls/id/C0074895
narrower: http://linkedlifedata.com/resource/umls/id/C0074896
narrower: http://linkedlifedata.com/resource/umls/id/C0381687
narrower: http://linkedlifedata.com/resource/umls/id/C0631378
narrower: http://linkedlifedata.com/resource/umls/id/C0631381
narrower: http://linkedlifedata.com/resource/umls/id/C0636208
narrower: http://linkedlifedata.com/resource/umls/id/C0638469
narrower: http://linkedlifedata.com/resource/umls/id/C0638759
narrower: http://linkedlifedata.com/resource/umls/id/C0651131
narrower: http://linkedlifedata.com/resource/umls/id/C0659536
narrower: http://linkedlifedata.com/resource/umls/id/C0912185
relation: R32107114
relation: R120456295
relation: R120456296
relation: R120456297
relation: R120456299
relation: R120456300