http://linkedlifedata.com/resource/umls/id/C0033684
type: T116
type: T123
type: Concept
has correlation: ANAT
has correlation: DISO
has correlation: GENE
has correlation: PHYS
has correlation: PHEN
has correlation: PROC
has correlation: OBJC
has correlation: DEVI
has correlation: CONC
has correlation: OCCU
has correlation: CHEM
definition: MSH: Linear POLYPEPTIDES that are synthesized on RIBOSOMES and may be further modified, crosslinked, cleaved, or assembled into complex proteins with several subunits. The specific sequence of AMINO ACIDS determines the shape the polypeptide will take, during PROTEIN FOLDING, and the function of the protein.,CSP: linear polymers of alpha-L-aminoacids ranging in size from a few thousand to over 1 million daltons, capable of oligomerization, with specific functions dictated by aminoacid sequence and encoded genetically.,NCI: A molecule made up of amino acids that are needed for the body to function properly. Proteins are the basis of body structures such as skin and hair and of substances such as enzymes, cytokines, and antibodies.,NCI: A group of complex organic macromolecules composed of one or more chains (linear polymers) of alpha-L-amino acids linked by peptide bonds and ranging in size from a few thousand to over 1 million Daltons. Proteins are fundamental genetically encoded components of living cells wi
in scheme: umls
broader: http://linkedlifedata.com/resource/umls/id/C0002526
broader: http://linkedlifedata.com/resource/umls/id/C0030956
narrower: http://linkedlifedata.com/resource/umls/id/C0034861
narrower: http://linkedlifedata.com/resource/umls/id/C0016829
narrower: http://linkedlifedata.com/resource/umls/id/C0032089
narrower: http://linkedlifedata.com/resource/umls/id/C0001924
narrower: http://linkedlifedata.com/resource/umls/id/C0761756
narrower: http://linkedlifedata.com/resource/umls/id/C1332035
narrower: http://linkedlifedata.com/resource/umls/id/C0005832
narrower: http://linkedlifedata.com/resource/umls/id/C0025252
narrower: http://linkedlifedata.com/resource/umls/id/C0026832
narrower: http://linkedlifedata.com/resource/umls/id/C0903042
narrower: http://linkedlifedata.com/resource/umls/id/C0019046
narrower: http://linkedlifedata.com/resource/umls/id/C0597357
narrower: http://linkedlifedata.com/resource/umls/id/C0017968
narrower: http://linkedlifedata.com/resource/umls/id/C0021699
narrower: http://linkedlifedata.com/resource/umls/id/C1179841
narrower: http://linkedlifedata.com/resource/umls/id/C0028589
narrower: http://linkedlifedata.com/resource/umls/id/C0001239
narrower: http://linkedlifedata.com/resource/umls/id/C0010852
narrower: http://linkedlifedata.com/resource/umls/id/C0021769
narrower: http://linkedlifedata.com/resource/umls/id/C0026045
narrower: http://linkedlifedata.com/resource/umls/id/C0033693
narrower: http://linkedlifedata.com/resource/umls/id/C0004627
narrower: http://linkedlifedata.com/resource/umls/id/C1178989
narrower: http://linkedlifedata.com/resource/umls/id/C0021027
narrower: http://linkedlifedata.com/resource/umls/id/C0006732
narrower: http://linkedlifedata.com/resource/umls/id/C0007292
narrower: http://linkedlifedata.com/resource/umls/id/C0013700
narrower: http://linkedlifedata.com/resource/umls/id/C0016223
narrower: http://linkedlifedata.com/resource/umls/id/C0018850
narrower: http://linkedlifedata.com/resource/umls/id/C0019652
narrower: http://linkedlifedata.com/resource/umls/id/C0025544
narrower: http://linkedlifedata.com/resource/umls/id/C0028612
narrower: http://linkedlifedata.com/resource/umls/id/C0029005
narrower: http://linkedlifedata.com/resource/umls/id/C0031689
narrower: http://linkedlifedata.com/resource/umls/id/C0036425
narrower: http://linkedlifedata.com/resource/umls/id/C0041538
narrower: http://linkedlifedata.com/resource/umls/id/C0042736
narrower: http://linkedlifedata.com/resource/umls/id/C0061928
narrower: http://linkedlifedata.com/resource/umls/id/C0071728
narrower: http://linkedlifedata.com/resource/umls/id/C0086376
narrower: http://linkedlifedata.com/resource/umls/id/C0104230
narrower: http://linkedlifedata.com/resource/umls/id/C0120285
narrower: http://linkedlifedata.com/resource/umls/id/C0243021
narrower: http://linkedlifedata.com/resource/umls/id/C1137868
narrower: http://linkedlifedata.com/resource/umls/id/C1439195
narrower: http://linkedlifedata.com/resource/umls/id/C0251712
narrower: http://linkedlifedata.com/resource/umls/id/C1179132
narrower: http://linkedlifedata.com/resource/umls/id/C1430074
narrower: http://linkedlifedata.com/resource/umls/id/C1430372
narrower: http://linkedlifedata.com/resource/umls/id/C1438157
narrower: http://linkedlifedata.com/resource/umls/id/C1313097
narrower: http://linkedlifedata.com/resource/umls/id/C1313098
narrower: http://linkedlifedata.com/resource/umls/id/C1336600
narrower: http://linkedlifedata.com/resource/umls/id/C0178763
narrower: http://linkedlifedata.com/resource/umls/id/C0242210
narrower: http://linkedlifedata.com/resource/umls/id/C0893654
narrower: http://linkedlifedata.com/resource/umls/id/C1506771
narrower: http://linkedlifedata.com/resource/umls/id/C1309066
narrower: http://linkedlifedata.com/resource/umls/id/C0052610
narrower: http://linkedlifedata.com/resource/umls/id/C1175865
narrower: http://linkedlifedata.com/resource/umls/id/C0967280
narrower: http://linkedlifedata.com/resource/umls/id/C1453223