http://linkedlifedata.com/resource/umls/id/C0032821
type: T196
type: Concept
has correlation: ANAT
has correlation: DISO
has correlation: PHYS
has correlation: PHEN
has correlation: PROC
has correlation: OBJC
has correlation: DEVI
has correlation: CONC
has correlation: CHEM
definition: MSH: An element that is in the alkali group of metals. It has an atomic symbol K, atomic number 19, and atomic weight 39.10. It is the chief cation in the intracellular fluid of muscle and other cells. Potassium ion is a strong electrolyte and it plays a significant role in the regulation of fluid volume and maintenance of the water-electrolyte balance.,CSP: metallic element of the alkali group, many of whose salts are used in medicine; atomic number 19, symbol K.,NCI: A metallic element that is important in body functions such as regulation of blood pressure and of water content in cells, transmission of nerve impulses, digestion, muscle contraction, and heartbeat.,NCI: An element with atomic symbol K, atomic number 19, and atomic weight 39.10.
in scheme: umls
broader: http://linkedlifedata.com/resource/umls/id/C0025554
narrower: http://linkedlifedata.com/resource/umls/id/C0607874
relation: R112186623
relation: R32173340
relation: R120419578
relation: R120419579
relation: R120419582
relation: R120419583
relation: R120419584
relation: R120419585
relation: R120419586
relation: R120419587
relation: R120419589
relation: R120419590
relation: R120419591
relation: R120419593
relation: R120419594
relation: R120419595
relation: R120419596
relation: R120419597
relation: R120419598
relation: R120419599
relation: R120419600
relation: R120419601
relation: R120419602
relation: R120419603
relation: R120419588
relation: R120419580
relation: R120419592
relation: R71272469
relation: R128913134
relation: R128913135
relation: R128913132
relation: R128913136
relation: R128913133
relation: R128913137
relation: R128913138
relation: R128913139
relation: R28389994
relation: R28389995
relation: R28389997
relation: R28389998
relation: R71303336
relation: R71413926
relation: R71303377
relation: R71275894
relation: R71386114
relation: R112186624
relation: R05219320
relation: R00692909
relation: R00727164
relation: R05242596
relation: R05242600
relation: R05242597
relation: R05242598
relation: R05242599
relation: R05674226
relation: R00895204
relation: R00914115
relation: R00914116
relation: R00914117
relation: R44024888
relation: R05730399
relation: R05730400
relation: R05730401
relation: R05730402
relation: R01374263