http://linkedlifedata.com/resource/umls/id/C0030705
type: T101
type: Concept
has correlation: LIVB
has correlation: ANAT
has correlation: DISO
has correlation: PHYS
has correlation: PROC
has correlation: CONC
definition: MSH: Individuals participating in the health care system for the purpose of receiving therapeutic, diagnostic, or preventive procedures.,NCI: Person under a physician's care for a particular disease or condition. NOTE: A subject in a clinical trial is not necessarily a patient, but a patient in a clinical trial is a subject. See also subject, trial subject, healthy volunteer. Often used interchangeably as a synonym for subject but healthy volunteers are not, strictly speaking, patients.,NCI: A patient is the subject of observations.,NCI: A person who receives medical attention, care, or treatment, or who is registered with medical professional or institution with the purpose to receive medical care when necessary.
in scheme: umls
narrower: http://linkedlifedata.com/resource/umls/id/C0021562
narrower: http://linkedlifedata.com/resource/umls/id/C0029921
relation: R28434058
relation: R28510975
relation: R31978033
relation: R120401048
relation: R120401049
relation: R120401050
relation: R120401052
relation: R120401051
relation: R71354545
relation: R71300989
relation: R71341015
relation: R71078804
relation: R71168207
relation: R71338159
relation: R71282346
relation: R71234315
relation: R71096600
relation: R28389623
relation: R28389624
relation: R71400300
relation: R71289488
relation: R71069170
relation: R71344856
relation: R71289998
relation: R71069605
relation: R71399721
relation: R71069136
relation: R71263587
relation: R71234560
relation: R71124395
relation: R71014767
relation: R71152759
relation: R71345419
relation: R71235322
relation: R71345584
relation: R71070138
relation: R71152746
relation: R71207916
relation: R70988352
relation: R71043008
relation: R71098203
relation: R71043009
relation: R71152751
relation: R71207932
relation: R71043012
relation: R71152752
relation: R71152753
relation: R71098180
relation: R71207922
relation: R70988356
relation: R71263584
relation: R71373500
relation: R71152764
relation: R71043013
relation: R70988357
relation: R71207931
relation: R70988363
relation: R111780450
relation: R129112015
relation: R70988367
relation: R71207937
relation: R71373499
relation: R71098192
relation: R100043756
relation: R71318411
relation: R111780451
relation: R71043031
relation: R71043032