http://linkedlifedata.com/resource/umls/id/C0021641
type: T116
type: T121
type: T125
type: Concept
has correlation: ANAT
has correlation: DISO
has correlation: GENE
has correlation: PHYS
has correlation: PHEN
has correlation: PROC
has correlation: DEVI
has correlation: CONC
has correlation: CHEM
definition: MSH: A 51-amino acid pancreatic hormone that plays a major role in the regulation of glucose metabolism, directly by suppressing endogenous glucose production (GLYCOGENOLYSIS; GLUCONEOGENESIS) and indirectly by suppressing GLUCAGON secretion and LIPOLYSIS. Native insulin is a globular protein comprised of a zinc-coordinated hexamer. Each insulin monomer containing two chains, A (21 residues) and B (30 residues), linked by two disulfide bonds. Insulin is used as a drug to control insulin-dependent diabetes mellitus (DIABETES MELLITUS, TYPE 1).,CSP: protein hormone secreted by beta cells of the pancreas; insulin plays a major role in the regulation of glucose metabolism, generally promoting the cellular utilization of glucose and is also an important regulator of protein and lipid metabolism; insulin is used as a drug to control insulin-dependent diabetes mellitus.,NCI: Human insulin protein (110 aa, 12 kDa) is encoded by the human insulin (INS) gene. This cytosolic protein, a heterodimer of disulfide-linked al
in scheme: umls
broader: http://linkedlifedata.com/resource/umls/id/C0030292
broader: http://linkedlifedata.com/resource/umls/id/C0020616
broader: http://linkedlifedata.com/resource/umls/id/C0815047
broader: http://linkedlifedata.com/resource/umls/id/C0312439
narrower: http://linkedlifedata.com/resource/umls/id/C0017687
narrower: http://linkedlifedata.com/resource/umls/id/C0033362
narrower: http://linkedlifedata.com/resource/umls/id/C0020884
narrower: http://linkedlifedata.com/resource/umls/id/C1313386
narrower: http://linkedlifedata.com/resource/umls/id/C0249860
narrower: http://linkedlifedata.com/resource/umls/id/C0063657
narrower: http://linkedlifedata.com/resource/umls/id/C0028467
narrower: http://linkedlifedata.com/resource/umls/id/C1176237
narrower: http://linkedlifedata.com/resource/umls/id/C0051301
narrower: http://linkedlifedata.com/resource/umls/id/C0063672
narrower: http://linkedlifedata.com/resource/umls/id/C0021642
narrower: http://linkedlifedata.com/resource/umls/id/C0037520
narrower: http://linkedlifedata.com/resource/umls/id/C0057819
narrower: http://linkedlifedata.com/resource/umls/id/C0058735
narrower: http://linkedlifedata.com/resource/umls/id/C0061420
narrower: http://linkedlifedata.com/resource/umls/id/C0063610
narrower: http://linkedlifedata.com/resource/umls/id/C0063618
narrower: http://linkedlifedata.com/resource/umls/id/C0063624
narrower: http://linkedlifedata.com/resource/umls/id/C0063626
narrower: http://linkedlifedata.com/resource/umls/id/C0063627
narrower: http://linkedlifedata.com/resource/umls/id/C0063628
narrower: http://linkedlifedata.com/resource/umls/id/C0063629
narrower: http://linkedlifedata.com/resource/umls/id/C0063630
narrower: http://linkedlifedata.com/resource/umls/id/C0063631
narrower: http://linkedlifedata.com/resource/umls/id/C0063632
narrower: http://linkedlifedata.com/resource/umls/id/C0063633
narrower: http://linkedlifedata.com/resource/umls/id/C0063634
narrower: http://linkedlifedata.com/resource/umls/id/C0063635
narrower: http://linkedlifedata.com/resource/umls/id/C0063636
narrower: http://linkedlifedata.com/resource/umls/id/C0063637
narrower: http://linkedlifedata.com/resource/umls/id/C0063638
narrower: http://linkedlifedata.com/resource/umls/id/C0063639
narrower: http://linkedlifedata.com/resource/umls/id/C0063640
narrower: http://linkedlifedata.com/resource/umls/id/C0063641
narrower: http://linkedlifedata.com/resource/umls/id/C0063645
narrower: http://linkedlifedata.com/resource/umls/id/C0063646
narrower: http://linkedlifedata.com/resource/umls/id/C0063647
narrower: http://linkedlifedata.com/resource/umls/id/C0063648
narrower: http://linkedlifedata.com/resource/umls/id/C0063650
narrower: http://linkedlifedata.com/resource/umls/id/C0063651
narrower: http://linkedlifedata.com/resource/umls/id/C0063652
narrower: http://linkedlifedata.com/resource/umls/id/C0063653
narrower: http://linkedlifedata.com/resource/umls/id/C0063654
narrower: http://linkedlifedata.com/resource/umls/id/C0063655
narrower: http://linkedlifedata.com/resource/umls/id/C0063656
narrower: http://linkedlifedata.com/resource/umls/id/C0063658
narrower: http://linkedlifedata.com/resource/umls/id/C0063659
narrower: http://linkedlifedata.com/resource/umls/id/C0063660
narrower: http://linkedlifedata.com/resource/umls/id/C0063662
narrower: http://linkedlifedata.com/resource/umls/id/C0063663
narrower: http://linkedlifedata.com/resource/umls/id/C0063664
narrower: http://linkedlifedata.com/resource/umls/id/C0063665
narrower: http://linkedlifedata.com/resource/umls/id/C0063666
narrower: http://linkedlifedata.com/resource/umls/id/C0063667
narrower: http://linkedlifedata.com/resource/umls/id/C0063668
narrower: http://linkedlifedata.com/resource/umls/id/C0063669
narrower: http://linkedlifedata.com/resource/umls/id/C0063681
narrower: http://linkedlifedata.com/resource/umls/id/C0071928
narrower: http://linkedlifedata.com/resource/umls/id/C0083018
narrower: http://linkedlifedata.com/resource/umls/id/C0083020
narrower: http://linkedlifedata.com/resource/umls/id/C0083022