http://linkedlifedata.com/resource/umls/id/C0021368
type: T046
type: Concept
has correlation: LIVB
has correlation: ANAT
has correlation: DISO
has correlation: GENE
has correlation: PHYS
has correlation: PHEN
has correlation: PROC
has correlation: DEVI
has correlation: CONC
has correlation: CHEM
definition: MSH: A pathological process characterized by injury or destruction of tissues caused by a variety of cytologic and chemical reactions. It is usually manifested by typical signs of pain, heat, redness, swelling, and loss of function.,CSP: pathological process characterized by injury or destruction of tissues caused by a variety of cytologic and chemical reactions; usually manifested by typical signs of pain, heat, redness, swelling, and loss of function.,NCI: Redness, swelling, pain, and/or a feeling of heat in an area of the body. This is a protective reaction to injury, disease, or irritation of the tissues.,NCI: A localized protective response resulting from injury or destruction of tissues. Inflammation serves to destroy, dilute, or wall off both the injurious agent and the injured tissue. In the acute phase, inflammation is characterized by the signs of pain, heat, redness, swelling, and loss of function. Histologically, inflammation involves a complex series of events, including dilatation of arterioles,
in scheme: umls
broader: http://linkedlifedata.com/resource/umls/id/C0030660
broader: http://linkedlifedata.com/resource/umls/id/C0679333
narrower: http://linkedlifedata.com/resource/umls/id/C0016549
relation: R28409233
relation: R28502132
relation: R64592329
relation: R120334409
relation: R120334410
relation: R120334411
relation: R120334412
relation: R120334414
relation: R120334416
relation: R120334417
relation: R120334418
relation: R120334419
relation: R120334420
relation: R120334430
relation: R120334421
relation: R120334422
relation: R120334423
relation: R120334424
relation: R120334426
relation: R120334427
relation: R120334428
relation: R120334429
relation: R120334433
relation: R120334434
relation: R120334436
relation: R120334437
relation: R120334438
relation: R120334439
relation: R120334440
relation: R120334441
relation: R120334442
relation: R120334443
relation: R120334444
relation: R120334445
relation: R120334432
relation: R120334413
relation: R120334425
relation: R120334435
relation: R120334415
relation: R120334431
relation: R71187999
relation: R71388276
relation: R71228672
relation: R71357677
relation: R71351370
relation: R71127564
relation: R71403720
relation: R71369371
relation: R128850525
relation: R28388160
relation: R28388161
relation: R71192597
relation: R71192232
relation: R71137414
relation: R71192552
relation: R71082906
relation: R71249758
relation: R71194303
relation: R71138753
relation: R71084215
relation: R71249776
relation: R71139162
relation: R71304823