http://linkedlifedata.com/resource/umls/id/C0006434
type: T037
type: Concept
has correlation: LIVB
has correlation: ANAT
has correlation: DISO
has correlation: PHYS
has correlation: PHEN
has correlation: ACTI
has correlation: PROC
has correlation: OBJC
has correlation: DEVI
has correlation: CONC
has correlation: OCCU
has correlation: ORGA
has correlation: CHEM
definition: MSH: Injuries to tissues caused by contact with heat, steam, chemicals (BURNS, CHEMICAL), electricity (BURNS, ELECTRIC), or the like.,CSP: damage inflicted on any part of an organism as the direct or indirect result of exposure to steam, chemicals, heat, flame, electricity or the like, with or without disruption of structural continuity; for burns due to overexposure to the sun use SUNBURN.,MEDLINEPLUS: A burn is damage to your body's tissues caused by heat, chemicals, electricity, sunlight or radiation. Scalds from hot liquids and steam, building fires and flammable liquids and gases are the most common causes of burns. There are three types of burns: First-degree burns damage only the outer layer of skin Second-degree burns damage the outer layer and the layer underneath Third-degree burns damage or destroy the deepest layer of skin and tissues underneath Burns can cause swelling, blistering, scarring and, in serious cases, shock and even death. They al
in scheme: umls
broader: http://linkedlifedata.com/resource/umls/id/C0332685
narrower: http://linkedlifedata.com/resource/umls/id/C0038814
relation: R28409187
relation: R05300644
relation: R05302003
relation: R05302004
relation: R05302005
relation: R05302007
relation: R05302008
relation: R05302013
relation: R05302006
relation: R44102397
relation: R05302011
relation: R44102396
relation: R05302009
relation: R111921086
relation: R111874938
relation: R111874882
relation: R111874941
relation: R111874883
relation: R111874884
relation: R111874885
relation: R111874886
relation: R111874887
relation: R111874889
relation: R111874890
relation: R111874891
relation: R111874892
relation: R111874893
relation: R111875048
relation: R111874895
relation: R111874896
relation: R111874898
relation: R111875215
relation: R134131689
relation: R134131691
relation: R134131693
relation: R134131697
relation: R134131701
relation: R134131703
relation: R134131705
relation: R134131711
relation: R134131713
relation: R134131715
relation: R134131717
relation: R134131719
relation: R134131721
relation: R134131723
relation: R134131725
relation: R134131727
relation: R134131729
relation: R134131731
relation: R134131733
relation: R134131735
relation: R134131737
relation: R134131739
relation: R134131741
relation: R134131743
relation: R134131745
relation: R134131747
relation: R134131749
relation: R134131751
relation: R134131753