http://linkedlifedata.com/resource/umls/id/C0003250
type: T116
type: T129
type: Concept
has correlation: ANAT
has correlation: PHYS
has correlation: PHEN
has correlation: PROC
has correlation: CONC
has correlation: OCCU
has correlation: CHEM
definition: MSH: Antibodies produced by a single clone of cells.,CSP: homogeneous antibody that is produced by a clone of antibody forming cells and that binds with a single antigenic determinant.,NCI: A type of protein made in the laboratory that can bind to substances in the body, including tumor cells. There are many kinds of monoclonal antibodies. Each monoclonal antibody is made to find one substance. Monoclonal antibodies are being used to treat some types of cancer and are being studied in the treatment of other types. They can be used alone or to carry drugs, toxins, or radioactive materials directly to a tumor.,NCI: An antibody produced by a clone or genetically homogenous fast-growing cells i.e., hybridoma. Hybridoma cells are cloned to establish cell lines producing a specific antibody that is chemically and immunologically homogeneous. They are widely used in cancer detection, diagnosis, and treatment.
in scheme: umls
broader: http://linkedlifedata.com/resource/umls/id/C0003241
broader: http://linkedlifedata.com/resource/umls/id/C0021054
narrower: http://linkedlifedata.com/resource/umls/id/C0655013
narrower: http://linkedlifedata.com/resource/umls/id/C1832027
narrower: http://linkedlifedata.com/resource/umls/id/C1367202
narrower: http://linkedlifedata.com/resource/umls/id/C1529682
narrower: http://linkedlifedata.com/resource/umls/id/C0288672
narrower: http://linkedlifedata.com/resource/umls/id/C0877880
narrower: http://linkedlifedata.com/resource/umls/id/C0669084
narrower: http://linkedlifedata.com/resource/umls/id/C0676831
narrower: http://linkedlifedata.com/resource/umls/id/C0296314
narrower: http://linkedlifedata.com/resource/umls/id/C2718773
narrower: http://linkedlifedata.com/resource/umls/id/C2353893
narrower: http://linkedlifedata.com/resource/umls/id/C0666743
narrower: http://linkedlifedata.com/resource/umls/id/C1174995
narrower: http://linkedlifedata.com/resource/umls/id/C0279218
narrower: http://linkedlifedata.com/resource/umls/id/C0281581
narrower: http://linkedlifedata.com/resource/umls/id/C0530093
narrower: http://linkedlifedata.com/resource/umls/id/C0540128
narrower: http://linkedlifedata.com/resource/umls/id/C0664207
narrower: http://linkedlifedata.com/resource/umls/id/C0879427
narrower: http://linkedlifedata.com/resource/umls/id/C0995188
narrower: http://linkedlifedata.com/resource/umls/id/C1098262
narrower: http://linkedlifedata.com/resource/umls/id/C1259827
narrower: http://linkedlifedata.com/resource/umls/id/C1312991
narrower: http://linkedlifedata.com/resource/umls/id/C1327944
narrower: http://linkedlifedata.com/resource/umls/id/C1327954
narrower: http://linkedlifedata.com/resource/umls/id/C1328236
narrower: http://linkedlifedata.com/resource/umls/id/C1511652
narrower: http://linkedlifedata.com/resource/umls/id/C1541160
narrower: http://linkedlifedata.com/resource/umls/id/C1608841
narrower: http://linkedlifedata.com/resource/umls/id/C1665688
narrower: http://linkedlifedata.com/resource/umls/id/C1690432
narrower: http://linkedlifedata.com/resource/umls/id/C1707382
narrower: http://linkedlifedata.com/resource/umls/id/C1721684
narrower: http://linkedlifedata.com/resource/umls/id/C1869412
narrower: http://linkedlifedata.com/resource/umls/id/C1881068
narrower: http://linkedlifedata.com/resource/umls/id/C2346820
narrower: http://linkedlifedata.com/resource/umls/id/C2346822
narrower: http://linkedlifedata.com/resource/umls/id/C2346838
narrower: http://linkedlifedata.com/resource/umls/id/C2742502
narrower: http://linkedlifedata.com/resource/umls/id/C0768182
narrower: http://linkedlifedata.com/resource/umls/id/C0295525
narrower: http://linkedlifedata.com/resource/umls/id/C1723386
narrower: http://linkedlifedata.com/resource/umls/id/C1869525
narrower: http://linkedlifedata.com/resource/umls/id/C1138401
narrower: http://linkedlifedata.com/resource/umls/id/C0020853
narrower: http://linkedlifedata.com/resource/umls/id/C0063369
narrower: http://linkedlifedata.com/resource/umls/id/C0078627
narrower: http://linkedlifedata.com/resource/umls/id/C0132092
narrower: http://linkedlifedata.com/resource/umls/id/C0209389
narrower: http://linkedlifedata.com/resource/umls/id/C0213677
narrower: http://linkedlifedata.com/resource/umls/id/C0217156
narrower: http://linkedlifedata.com/resource/umls/id/C0245612
narrower: http://linkedlifedata.com/resource/umls/id/C0246612
narrower: http://linkedlifedata.com/resource/umls/id/C0250873
narrower: http://linkedlifedata.com/resource/umls/id/C0250875
narrower: http://linkedlifedata.com/resource/umls/id/C0250876
narrower: http://linkedlifedata.com/resource/umls/id/C0251576
narrower: http://linkedlifedata.com/resource/umls/id/C0253183
narrower: http://linkedlifedata.com/resource/umls/id/C0259580
narrower: http://linkedlifedata.com/resource/umls/id/C0259637
narrower: http://linkedlifedata.com/resource/umls/id/C0287024
narrower: http://linkedlifedata.com/resource/umls/id/C0289425
narrower: http://linkedlifedata.com/resource/umls/id/C0382120
narrower: http://linkedlifedata.com/resource/umls/id/C0384167
narrower: http://linkedlifedata.com/resource/umls/id/C0390135
narrower: http://linkedlifedata.com/resource/umls/id/C0390863