http://linkedlifedata.com/resource/umls/id/C0003241
type: T116
type: T129
type: Concept
has correlation: ANAT
has correlation: DISO
has correlation: GENE
has correlation: PHYS
has correlation: PHEN
has correlation: PROC
has correlation: CONC
has correlation: OCCU
has correlation: CHEM
definition: MSH: Immunoglobulin molecules having a specific amino acid sequence by virtue of which they interact only with the ANTIGEN (or a very similar shape) that induced their synthesis in cells of the lymphoid series (especially PLASMA CELLS).,CSP: infection-fighting protein molecule in blood or secretory fluids that tags, neutralizes, and helps destroy pathogenic microorganisms such as bacteria or viruses and toxins; they are generally known as immunoglobulins, and are made and secreted by B-lymphocytes in response to stimulation by antigens; each specific antibody binds only to the specific antigen that stimulated its production.,NCI: A protein made by plasma cells (a type of white blood cell) in response to an antigen (a substance that causes the body to make a specific immune response). Each antibody can bind to only one specific antigen. The purpose of this binding is to help destroy the antigen. Some antibodies destroy antigens directly. Others make it easier for white blood cells to destroy the antigen.,NCI:
in scheme: umls
broader: http://linkedlifedata.com/resource/umls/id/C0021054
broader: http://linkedlifedata.com/resource/umls/id/C0815046
narrower: http://linkedlifedata.com/resource/umls/id/C0003248
narrower: http://linkedlifedata.com/resource/umls/id/C0022144
narrower: http://linkedlifedata.com/resource/umls/id/C0796473
narrower: http://linkedlifedata.com/resource/umls/id/C0003250
narrower: http://linkedlifedata.com/resource/umls/id/C0021027
narrower: http://linkedlifedata.com/resource/umls/id/C0001804
narrower: http://linkedlifedata.com/resource/umls/id/C0003242
narrower: http://linkedlifedata.com/resource/umls/id/C0003244
narrower: http://linkedlifedata.com/resource/umls/id/C0003251
narrower: http://linkedlifedata.com/resource/umls/id/C0003253
narrower: http://linkedlifedata.com/resource/umls/id/C0003445
narrower: http://linkedlifedata.com/resource/umls/id/C0004358
narrower: http://linkedlifedata.com/resource/umls/id/C0020960
narrower: http://linkedlifedata.com/resource/umls/id/C0029122
narrower: http://linkedlifedata.com/resource/umls/id/C0032936
narrower: http://linkedlifedata.com/resource/umls/id/C0162594
narrower: http://linkedlifedata.com/resource/umls/id/C0243020
narrower: http://linkedlifedata.com/resource/umls/id/C0282682
narrower: http://linkedlifedata.com/resource/umls/id/C0475463
narrower: http://linkedlifedata.com/resource/umls/id/C1433776
narrower: http://linkedlifedata.com/resource/umls/id/C0054402
narrower: http://linkedlifedata.com/resource/umls/id/C0076533
narrower: http://linkedlifedata.com/resource/umls/id/C0127194
narrower: http://linkedlifedata.com/resource/umls/id/C0258249
narrower: http://linkedlifedata.com/resource/umls/id/C0596114
narrower: http://linkedlifedata.com/resource/umls/id/C0596115
narrower: http://linkedlifedata.com/resource/umls/id/C0596731
narrower: http://linkedlifedata.com/resource/umls/id/C0762518
narrower: http://linkedlifedata.com/resource/umls/id/C0913885
narrower: http://linkedlifedata.com/resource/umls/id/C1121286
narrower: http://linkedlifedata.com/resource/umls/id/C1171887
narrower: http://linkedlifedata.com/resource/umls/id/C1434367
narrower: http://linkedlifedata.com/resource/umls/id/C1610826
narrower: http://linkedlifedata.com/resource/umls/id/C1624602
narrower: http://linkedlifedata.com/resource/umls/id/C1721391
narrower: http://linkedlifedata.com/resource/umls/id/C1741660
narrower: http://linkedlifedata.com/resource/umls/id/C2000618
narrower: http://linkedlifedata.com/resource/umls/id/C2003059
narrower: http://linkedlifedata.com/resource/umls/id/C2354538
narrower: http://linkedlifedata.com/resource/umls/id/C2604910
narrower: http://linkedlifedata.com/resource/umls/id/C2605890
narrower: http://linkedlifedata.com/resource/umls/id/C2932403
relation: R120196592
relation: R120196593
relation: R120196595
relation: R120196596
relation: R120196597
relation: R120196598
relation: R120196600
relation: R120196601
relation: R120196602
relation: R120196604
relation: R120196605
relation: R120196607
relation: R120196608
relation: R120196609
relation: R120196610
relation: R120196611
relation: R120196612
relation: R120196613
relation: R120196614
relation: R120196615
relation: R120196599
relation: R120196603