controller
type: ObjectProperty
comment: The controlling entity, e.g., in a biochemical reaction, an enzyme is the controlling entity of the reaction. CONTROLLER is a sub-property of PARTICIPANTS.
sub property of: participant
domain: Control