LEFT
type: ObjectProperty
comment: The participants on the left side of the conversion interaction. Since conversion interactions may proceed in either the left-to-right or right-to-left direction, occupants of the LEFT property may be either reactants or products. LEFT is a sub-property of PARTICIPANTS.
sub property of: PARTICIPANTS
range: physicalEntityParticipant
domain: conversion