http://linkedlifedata.com/resource/umls/id/C0086418
type: T016
type: Concept
has correlation: LIVB
has correlation: ANAT
has correlation: DISO
has correlation: GENE
has correlation: PHYS
has correlation: PHEN
has correlation: PROC
has correlation: DEVI
has correlation: CONC
has correlation: OCCU
has correlation: CHEM
definition: CSP: a general term for grouping human subject control terms; do not index, use NTs instead.,MSH: Members of the species Homo sapiens.,NCI: The bipedal primate mammal, Homo sapiens; belonging to man or mankind; pertaining to man or to the race of man; use of man as experimental subject or unit of analysis in research.
in scheme: umls
narrower: http://linkedlifedata.com/resource/umls/id/C0682515
relation: R05202818
relation: R05217137
relation: R00689915
relation: R00707708
relation: R00707709
relation: R00707710
relation: R69889879
relation: R05662516
relation: R05662519
relation: R05662517
relation: R05662518
relation: R05672751
relation: R00893730
relation: R00905890
relation: R00905893
relation: R00905891
relation: R00905892
relation: R00913539
relation: R05718867
relation: R05718858
relation: R05718856
relation: R05718857
relation: R05718871
relation: R05718862
relation: R05718859
relation: R05718860
relation: R05718869
relation: R05718863
relation: R05718864
relation: R05718865
relation: R05718861
relation: R05718870
relation: R05718866
relation: R05718868
relation: R48840202
relation: R64561542
relation: R64558207
relation: R120323738
relation: R120323739
relation: R120323740
relation: R120323741
relation: R120323742
relation: R120323743
relation: R120323744
relation: R120323748
relation: R120323749
relation: R120323751
relation: R120323753
relation: R120323754
relation: R120323755
relation: R120323745
relation: R120323747
relation: R120323746
relation: R120323752
relation: R120323750
relation: R71377790
relation: R71236588
relation: R71401936
relation: R111779211
relation: R70990398
relation: R129110738
relation: R32192322
relation: R32188696
relation: R54322734