http://linkedlifedata.com/resource/umls/id/C0043047
type: T121
type: T197
type: Concept
has correlation: ANAT
has correlation: DISO
has correlation: PHYS
has correlation: PHEN
has correlation: PROC
has correlation: OBJC
has correlation: DEVI
has correlation: CONC
has correlation: CHEM
definition: MSH: A clear, odorless, tasteless liquid that is essential for most animal and plant life and is an excellent solvent for many substances. The chemical formula is hydrogen oxide (H2O). (McGraw-Hill Dictionary of Scientific and Technical Terms, 4th ed),CSP: H2O; tasteless, colorless, odorless compound present in all organic tissues, and the most universal of solvents.,NCI: H2O, a clear, colorless, odorless, tasteless liquid that freezes into ice below 0 degrees centigrade and boils above 100 degrees centigrade.,NCI: Chemical compound that is liquid at room temperature and is composed two hydrogen atoms connected to an oxygen atom.
in scheme: umls
broader: http://linkedlifedata.com/resource/umls/id/C0030015
broader: http://linkedlifedata.com/resource/umls/id/C0682916
narrower: http://linkedlifedata.com/resource/umls/id/C0011745
narrower: http://linkedlifedata.com/resource/umls/id/C0077315
narrower: http://linkedlifedata.com/resource/umls/id/C0359299
narrower: http://linkedlifedata.com/resource/umls/id/C0540708
narrower: http://linkedlifedata.com/resource/umls/id/C2948996
narrower: http://linkedlifedata.com/resource/umls/id/C2949579
narrower: http://linkedlifedata.com/resource/umls/id/C2961556
narrower: http://linkedlifedata.com/resource/umls/id/C3254841
relation: R112187313
relation: R120498512
relation: R120498513
relation: R120498515
relation: R120498516
relation: R120498519
relation: R120498520
relation: R120498521
relation: R120498514
relation: R120498518
relation: R120498517
relation: R71121146
relation: R71179403
relation: R129106546
relation: R71410300
relation: R129106547
relation: R71166015
relation: R71220598
relation: R128967373
relation: R128967374
relation: R28391811
relation: R28391812
relation: R100027578
relation: R28391813
relation: R28391814
relation: R100027579
relation: R71076329
relation: R71135110
relation: R71186230
relation: R71080522
relation: R71411197
relation: R71025588
relation: R71407165
relation: R71407166
relation: R71080616
relation: R71025627
relation: R71246018
relation: R71410633
relation: R71245357
relation: R71351698
relation: R71079962
relation: R71410635
relation: R71162557
relation: R71213407
relation: R112187314
relation: R28523449
relation: R112188291
relation: R28449237
relation: R112189132
relation: R05219807
relation: R00693607
relation: R00710781
relation: R05244751
relation: R05244752
relation: R05664653
relation: R05675391