http://linkedlifedata.com/resource/umls/id/C0037494
type: T121
type: T123
type: T197
type: Concept
has correlation: ANAT
has correlation: DISO
has correlation: PHYS
has correlation: PHEN
has correlation: PROC
has correlation: OBJC
has correlation: DEVI
has correlation: CONC
has correlation: CHEM
definition: MSH: A ubiquitous sodium salt that is commonly used to season food.,CSP: NaCl; plays an important biological role in maintaining the osmotic tension of blood and tissues; for the sodium salt that is commonly used to season food use DIETARY SODIUM.,NCI: A metal halide composed of sodium and chloride with sodium and chloride replacement capabilities. When depleted in the body, sodium must be replaced in order to maintain intracellular osmolarity, nerve conduction, muscle contraction and normal renal function.
in scheme: umls
broader: http://linkedlifedata.com/resource/umls/id/C0206134
narrower: http://linkedlifedata.com/resource/umls/id/C1450420
narrower: http://linkedlifedata.com/resource/umls/id/C2364634
narrower: http://linkedlifedata.com/resource/umls/id/C0205951
narrower: http://linkedlifedata.com/resource/umls/id/C0147020
narrower: http://linkedlifedata.com/resource/umls/id/C2345281
narrower: http://linkedlifedata.com/resource/umls/id/C2345347
narrower: http://linkedlifedata.com/resource/umls/id/C2345353
narrower: http://linkedlifedata.com/resource/umls/id/C2345358
narrower: http://linkedlifedata.com/resource/umls/id/C2345366
narrower: http://linkedlifedata.com/resource/umls/id/C2345376
narrower: http://linkedlifedata.com/resource/umls/id/C2345378
narrower: http://linkedlifedata.com/resource/umls/id/C2345402
narrower: http://linkedlifedata.com/resource/umls/id/C2345659
narrower: http://linkedlifedata.com/resource/umls/id/C2345973
narrower: http://linkedlifedata.com/resource/umls/id/C2346032
narrower: http://linkedlifedata.com/resource/umls/id/C2346101
narrower: http://linkedlifedata.com/resource/umls/id/C2346120
narrower: http://linkedlifedata.com/resource/umls/id/C2346124
narrower: http://linkedlifedata.com/resource/umls/id/C2346128
narrower: http://linkedlifedata.com/resource/umls/id/C2346167
narrower: http://linkedlifedata.com/resource/umls/id/C2346182
narrower: http://linkedlifedata.com/resource/umls/id/C2356277
narrower: http://linkedlifedata.com/resource/umls/id/C2356284
narrower: http://linkedlifedata.com/resource/umls/id/C2586930
narrower: http://linkedlifedata.com/resource/umls/id/C2587022
narrower: http://linkedlifedata.com/resource/umls/id/C2587094
narrower: http://linkedlifedata.com/resource/umls/id/C2587130
narrower: http://linkedlifedata.com/resource/umls/id/C2587136
narrower: http://linkedlifedata.com/resource/umls/id/C2608113
narrower: http://linkedlifedata.com/resource/umls/id/C2608649
narrower: http://linkedlifedata.com/resource/umls/id/C2608653
narrower: http://linkedlifedata.com/resource/umls/id/C0391004
narrower: http://linkedlifedata.com/resource/umls/id/C0722050
narrower: http://linkedlifedata.com/resource/umls/id/C0534302
narrower: http://linkedlifedata.com/resource/umls/id/C2364764
narrower: http://linkedlifedata.com/resource/umls/id/C0139004
narrower: http://linkedlifedata.com/resource/umls/id/C0054180
narrower: http://linkedlifedata.com/resource/umls/id/C0640583
narrower: http://linkedlifedata.com/resource/umls/id/C1815369
narrower: http://linkedlifedata.com/resource/umls/id/C0075145
narrower: http://linkedlifedata.com/resource/umls/id/C0075156
narrower: http://linkedlifedata.com/resource/umls/id/C0078516
narrower: http://linkedlifedata.com/resource/umls/id/C0637482
narrower: http://linkedlifedata.com/resource/umls/id/C0723589
narrower: http://linkedlifedata.com/resource/umls/id/C0604837
narrower: http://linkedlifedata.com/resource/umls/id/C0720208
narrower: http://linkedlifedata.com/resource/umls/id/C2344965
narrower: http://linkedlifedata.com/resource/umls/id/C2344992
narrower: http://linkedlifedata.com/resource/umls/id/C2345003
narrower: http://linkedlifedata.com/resource/umls/id/C2345010
narrower: http://linkedlifedata.com/resource/umls/id/C2345012
narrower: http://linkedlifedata.com/resource/umls/id/C2345047
narrower: http://linkedlifedata.com/resource/umls/id/C2345952
narrower: http://linkedlifedata.com/resource/umls/id/C2346361
narrower: http://linkedlifedata.com/resource/umls/id/C2346366
narrower: http://linkedlifedata.com/resource/umls/id/C2346377
narrower: http://linkedlifedata.com/resource/umls/id/C2364789
narrower: http://linkedlifedata.com/resource/umls/id/C2729519
narrower: http://linkedlifedata.com/resource/umls/id/C2936715
narrower: http://linkedlifedata.com/resource/umls/id/C0720657
narrower: http://linkedlifedata.com/resource/umls/id/C0024416
narrower: http://linkedlifedata.com/resource/umls/id/C0064470
narrower: http://linkedlifedata.com/resource/umls/id/C0535827
narrower: http://linkedlifedata.com/resource/umls/id/C0071328