http://linkedlifedata.com/resource/umls/id/C0037473
type: T123
type: T196
type: Concept
has correlation: ANAT
has correlation: DISO
has correlation: PHYS
has correlation: PHEN
has correlation: PROC
has correlation: OBJC
has correlation: DEVI
has correlation: CONC
has correlation: CHEM
definition: MSH: A member of the alkali group of metals. It has the atomic symbol Na, atomic number 11, and atomic weight 23.,CSP: alkaline metallic element, symbol Na, atomic number 11.,NCI: A mineral needed by the body to keep body fluids in balance. Sodium is found in table salt and in many processed foods. Too much sodium can cause the body to retain water.,NCI: An element with atomic symbol Na, atomic number 11, and atomic weight 23.
in scheme: umls
broader: http://linkedlifedata.com/resource/umls/id/C0025554
narrower: http://linkedlifedata.com/resource/umls/id/C0141639
narrower: http://linkedlifedata.com/resource/umls/id/C0293725
relation: R112875688
relation: R32173705
relation: R120455375
relation: R120455376
relation: R120455379
relation: R120455380
relation: R120455381
relation: R120455383
relation: R120455384
relation: R120455385
relation: R120455387
relation: R120455388
relation: R120455389
relation: R120455391
relation: R120455392
relation: R120455393
relation: R120455394
relation: R120455395
relation: R120455396
relation: R120455397
relation: R120455398
relation: R120455399
relation: R120455400
relation: R120455401
relation: R120455386
relation: R120455377
relation: R120455390
relation: R120455382
relation: R70980996
relation: R128941297
relation: R128941296
relation: R128941298
relation: R128941299
relation: R128941300
relation: R128941301
relation: R128941302
relation: R128941303
relation: R128941304
relation: R28390928
relation: R28390929
relation: R28390930
relation: R28390931
relation: R28390932
relation: R71137846
relation: R71028072
relation: R71137847
relation: R71083156
relation: R71248633
relation: R112875689
relation: R05219547
relation: R00693251
relation: R00727451
relation: R05243598
relation: R05243602
relation: R05243599
relation: R05243600
relation: R05243601
relation: R18621102
relation: R05674760
relation: R00895738
relation: R00914403
relation: R44025026
relation: R43988531