http://linkedlifedata.com/resource/umls/id/C0035668
type: T114
type: Concept
has correlation: ANAT
has correlation: GENE
has correlation: PHYS
has correlation: PHEN
has correlation: PROC
has correlation: OBJC
has correlation: DEVI
has correlation: CONC
has correlation: CHEM
definition: CSP: ribonucleic acid; polynucleotide consisting essentially of chains with a repeating backbone of phosphate and ribose units to which nitrogenous bases are attached; RNA is unique among biological macromolecules in that it can encode genetic information, serve as an abundant structural component of cells, and also possesses catalytic activity.,MSH: A polynucleotide consisting essentially of chains with a repeating backbone of phosphate and ribose units to which nitrogenous bases are attached. RNA is unique among biological macromolecules in that it can encode genetic information, serve as an abundant structural component of cells, and also possesses catalytic activity. (Rieger et al., Glossary of Genetics: Classical and Molecular, 5th ed),NCI: One of two types of nucleic acid made by cells. Ribonucleic acid contains information that has been copied from DNA (the other type of nucleic acid). Cells make several different forms of ribonucleic acid, and each form has a specific job in the cell. Many forms of ri
in scheme: umls
broader: http://linkedlifedata.com/resource/umls/id/C0028606
narrower: http://linkedlifedata.com/resource/umls/id/C0035736
narrower: http://linkedlifedata.com/resource/umls/id/C0035701
narrower: http://linkedlifedata.com/resource/umls/id/C0035696
narrower: http://linkedlifedata.com/resource/umls/id/C0073434
narrower: http://linkedlifedata.com/resource/umls/id/C0080125
narrower: http://linkedlifedata.com/resource/umls/id/C0935992
narrower: http://linkedlifedata.com/resource/umls/id/C0035692
narrower: http://linkedlifedata.com/resource/umls/id/C0035693
narrower: http://linkedlifedata.com/resource/umls/id/C0035694
narrower: http://linkedlifedata.com/resource/umls/id/C0035695
narrower: http://linkedlifedata.com/resource/umls/id/C0035700
narrower: http://linkedlifedata.com/resource/umls/id/C0035709
narrower: http://linkedlifedata.com/resource/umls/id/C0035711
narrower: http://linkedlifedata.com/resource/umls/id/C0056208
narrower: http://linkedlifedata.com/resource/umls/id/C1099354
narrower: http://linkedlifedata.com/resource/umls/id/C1101610
narrower: http://linkedlifedata.com/resource/umls/id/C0073439
narrower: http://linkedlifedata.com/resource/umls/id/C0530830
narrower: http://linkedlifedata.com/resource/umls/id/C0058606
narrower: http://linkedlifedata.com/resource/umls/id/C0073429
narrower: http://linkedlifedata.com/resource/umls/id/C0073432
narrower: http://linkedlifedata.com/resource/umls/id/C0073433
narrower: http://linkedlifedata.com/resource/umls/id/C0073435
narrower: http://linkedlifedata.com/resource/umls/id/C0391719
narrower: http://linkedlifedata.com/resource/umls/id/C1566842
narrower: http://linkedlifedata.com/resource/umls/id/C1571018
narrower: http://linkedlifedata.com/resource/umls/id/C1611948
narrower: http://linkedlifedata.com/resource/umls/id/C1619939
narrower: http://linkedlifedata.com/resource/umls/id/C1741334
narrower: http://linkedlifedata.com/resource/umls/id/C1566102
narrower: http://linkedlifedata.com/resource/umls/id/C3489684
relation: R28410309
relation: R112184210
relation: R28515581
relation: R112186764
relation: R05202970
relation: R05202972
relation: R05202973
relation: R05202968
relation: R05202974
relation: R05202971
relation: R05202969
relation: R05202975
relation: R05217341
relation: R00690168
relation: R00707879
relation: R00707881
relation: R00707882
relation: R00707877
relation: R00707884
relation: R00707880
relation: R00707878
relation: R00707885
relation: R00707883
relation: R00725480
relation: R00725481
relation: R00725483
relation: R00725482
relation: R05233655
relation: R05233656
relation: R05233657
relation: R18620934
relation: R05657005
relation: R05657006
relation: R05657007
relation: R05657008