http://linkedlifedata.com/resource/umls/id/C0019080
type: T046
type: Concept
has correlation: ANAT
has correlation: DISO
has correlation: PHYS
has correlation: PHEN
has correlation: PROC
has correlation: DEVI
has correlation: CONC
has correlation: CHEM
definition: MSH: Bleeding or escape of blood from a vessel.,CSP: escape of blood from the vessels; bleeding.,NCI: In medicine, loss of blood from damaged blood vessels. A hemorrhage may be internal or external, and usually involves a lot of bleeding in a short time.,NCI: The flow of blood from a ruptured blood vessel.
in scheme: umls
narrower: http://linkedlifedata.com/resource/umls/id/C0035317
narrower: http://linkedlifedata.com/resource/umls/id/C0017181
narrower: http://linkedlifedata.com/resource/umls/id/C0036982
narrower: http://linkedlifedata.com/resource/umls/id/C0333106
narrower: http://linkedlifedata.com/resource/umls/id/C2937358
relation: R28409229
relation: R28499677
relation: R120316787
relation: R120316788
relation: R120316789
relation: R120316790
relation: R120316792
relation: R120316794
relation: R120316795
relation: R120316796
relation: R120316797
relation: R120316798
relation: R120316808
relation: R120316799
relation: R120316800
relation: R120316801
relation: R120316802
relation: R120316804
relation: R120316805
relation: R120316806
relation: R120316807
relation: R120316811
relation: R120316812
relation: R120316814
relation: R120316815
relation: R120316816
relation: R120316817
relation: R120316818
relation: R120316819
relation: R120316820
relation: R120316821
relation: R120316822
relation: R120316823
relation: R120316810
relation: R120316791
relation: R120316803
relation: R120316813
relation: R120316793
relation: R120316809
relation: R71119536
relation: R71189017
relation: R71292568
relation: R71404813
relation: R71244342
relation: R71129145
relation: R71409248
relation: R71024018
relation: R71192516
relation: R71066669
relation: R71352683
relation: R71026522
relation: R71238119
relation: R71408544
relation: R119526364
relation: R71009155
relation: R71287590
relation: R71009229
relation: R71131980
relation: R119526365
relation: R71231174
relation: R71365671
relation: R128839587
relation: R28387747