http://linkedlifedata.com/resource/umls/id/C0017968
type: T116
type: T118
type: Concept
has correlation: ANAT
has correlation: DISO
has correlation: GENE
has correlation: PHYS
has correlation: PHEN
has correlation: PROC
has correlation: OBJC
has correlation: CONC
has correlation: CHEM
definition: MSH: Conjugated protein-carbohydrate compounds including mucins, mucoid, and amyloid glycoproteins.,CSP: ubiquitous family of proteins with covalently attached oligosaccharide side chains which impart unique properties of solubility, size, antigenicity, ligand affinity, cellular targetting, and stability.,NCI: A protein that has sugar molecules attached to it.,NCI: A conjugated protein having a carbohydrate component.
in scheme: umls
broader: http://linkedlifedata.com/resource/umls/id/C0033684
broader: http://linkedlifedata.com/resource/umls/id/C0815049
narrower: http://linkedlifedata.com/resource/umls/id/C0014822
narrower: http://linkedlifedata.com/resource/umls/id/C0040679
narrower: http://linkedlifedata.com/resource/umls/id/C0051755
narrower: http://linkedlifedata.com/resource/umls/id/C0217525
narrower: http://linkedlifedata.com/resource/umls/id/C0022984
narrower: http://linkedlifedata.com/resource/umls/id/C0033692
narrower: http://linkedlifedata.com/resource/umls/id/C0059377
narrower: http://linkedlifedata.com/resource/umls/id/C0076088
narrower: http://linkedlifedata.com/resource/umls/id/C0076560
narrower: http://linkedlifedata.com/resource/umls/id/C0060321
narrower: http://linkedlifedata.com/resource/umls/id/C0759653
narrower: http://linkedlifedata.com/resource/umls/id/C0023610
narrower: http://linkedlifedata.com/resource/umls/id/C0733758
narrower: http://linkedlifedata.com/resource/umls/id/C0023607
narrower: http://linkedlifedata.com/resource/umls/id/C0040123
narrower: http://linkedlifedata.com/resource/umls/id/C0534578
narrower: http://linkedlifedata.com/resource/umls/id/C1141639
narrower: http://linkedlifedata.com/resource/umls/id/C0597698
narrower: http://linkedlifedata.com/resource/umls/id/C0021918
narrower: http://linkedlifedata.com/resource/umls/id/C0007578
narrower: http://linkedlifedata.com/resource/umls/id/C0025248
narrower: http://linkedlifedata.com/resource/umls/id/C0026714
narrower: http://linkedlifedata.com/resource/umls/id/C0029297
narrower: http://linkedlifedata.com/resource/umls/id/C0002716
narrower: http://linkedlifedata.com/resource/umls/id/C0003987
narrower: http://linkedlifedata.com/resource/umls/id/C0027900
narrower: http://linkedlifedata.com/resource/umls/id/C0029446
narrower: http://linkedlifedata.com/resource/umls/id/C0037028
narrower: http://linkedlifedata.com/resource/umls/id/C0041368
narrower: http://linkedlifedata.com/resource/umls/id/C0053935
narrower: http://linkedlifedata.com/resource/umls/id/C0055966
narrower: http://linkedlifedata.com/resource/umls/id/C0129439
narrower: http://linkedlifedata.com/resource/umls/id/C1456454
narrower: http://linkedlifedata.com/resource/umls/id/C1181101
narrower: http://linkedlifedata.com/resource/umls/id/C0015506
narrower: http://linkedlifedata.com/resource/umls/id/C0632750
narrower: http://linkedlifedata.com/resource/umls/id/C0033621
narrower: http://linkedlifedata.com/resource/umls/id/C0673028
narrower: http://linkedlifedata.com/resource/umls/id/C0055271
narrower: http://linkedlifedata.com/resource/umls/id/C0387407
narrower: http://linkedlifedata.com/resource/umls/id/C1431218
narrower: http://linkedlifedata.com/resource/umls/id/C0076067
narrower: http://linkedlifedata.com/resource/umls/id/C0051268
narrower: http://linkedlifedata.com/resource/umls/id/C0256829
narrower: http://linkedlifedata.com/resource/umls/id/C1505776
narrower: http://linkedlifedata.com/resource/umls/id/C1431107
narrower: http://linkedlifedata.com/resource/umls/id/C0055601
narrower: http://linkedlifedata.com/resource/umls/id/C1431109
narrower: http://linkedlifedata.com/resource/umls/id/C0530702
narrower: http://linkedlifedata.com/resource/umls/id/C0071190
narrower: http://linkedlifedata.com/resource/umls/id/C0017954
narrower: http://linkedlifedata.com/resource/umls/id/C0298192
narrower: http://linkedlifedata.com/resource/umls/id/C0054832
narrower: http://linkedlifedata.com/resource/umls/id/C0893658
narrower: http://linkedlifedata.com/resource/umls/id/C0906452
narrower: http://linkedlifedata.com/resource/umls/id/C1453812
narrower: http://linkedlifedata.com/resource/umls/id/C1448959
narrower: http://linkedlifedata.com/resource/umls/id/C0164233
narrower: http://linkedlifedata.com/resource/umls/id/C0219116
narrower: http://linkedlifedata.com/resource/umls/id/C0640646
narrower: http://linkedlifedata.com/resource/umls/id/C0071196
narrower: http://linkedlifedata.com/resource/umls/id/C1437242
narrower: http://linkedlifedata.com/resource/umls/id/C1447920
narrower: http://linkedlifedata.com/resource/umls/id/C1436632