http://linkedlifedata.com/resource/umls/id/C0017725
type: T118
type: T121
type: T123
type: Concept
has correlation: DISO
has correlation: PHYS
has correlation: PHEN
has correlation: PROC
has correlation: OBJC
has correlation: DEVI
has correlation: CONC
has correlation: CHEM
definition: MSH: A primary source of energy for living organisms. It is naturally occurring and is found in fruits and other parts of plants in its free state. It is used therapeutically in fluid and nutrient replacement.,CSP: aldohexose occurring as the D form and found as a free monosaccharide in fruits and other parts of plants and in the normal blood of all animals; the end product of carbohydrate metabolism and the chief source of energy for most living organisms.,NCI: A type of sugar; the chief source of energy for living organisms.,NCI: A hexose with an aldehyde group; in which each of the 5 remaining carbons other than the aldehyde group has one hydroxyl group in the R,S,R, and R configuration counting from the first hydroxyl containing carbon next to the aldehyde in the straight chain (Fisher) projection; otherwise all carbons have exclusively hydrogens. Occurs mostly as pyran (6-membered oxygen containing ring or oxane) and rarely as furan (5-membered oxygen containing ring) or straight chain. When glucose form
in scheme: umls
broader: http://linkedlifedata.com/resource/umls/id/C0019494
narrower: http://linkedlifedata.com/resource/umls/id/C0011501
narrower: http://linkedlifedata.com/resource/umls/id/C0538727
narrower: http://linkedlifedata.com/resource/umls/id/C0005802
narrower: http://linkedlifedata.com/resource/umls/id/C2931948
narrower: http://linkedlifedata.com/resource/umls/id/C1657537
narrower: http://linkedlifedata.com/resource/umls/id/C0055816
narrower: http://linkedlifedata.com/resource/umls/id/C0055893
narrower: http://linkedlifedata.com/resource/umls/id/C0063739
narrower: http://linkedlifedata.com/resource/umls/id/C2344988
narrower: http://linkedlifedata.com/resource/umls/id/C2345039
narrower: http://linkedlifedata.com/resource/umls/id/C2345043
narrower: http://linkedlifedata.com/resource/umls/id/C2345053
narrower: http://linkedlifedata.com/resource/umls/id/C2345281
narrower: http://linkedlifedata.com/resource/umls/id/C2345299
narrower: http://linkedlifedata.com/resource/umls/id/C2345303
narrower: http://linkedlifedata.com/resource/umls/id/C2345307
narrower: http://linkedlifedata.com/resource/umls/id/C2345311
narrower: http://linkedlifedata.com/resource/umls/id/C2345315
narrower: http://linkedlifedata.com/resource/umls/id/C2345332
narrower: http://linkedlifedata.com/resource/umls/id/C2345337
narrower: http://linkedlifedata.com/resource/umls/id/C2345341
narrower: http://linkedlifedata.com/resource/umls/id/C2345347
narrower: http://linkedlifedata.com/resource/umls/id/C2345353
narrower: http://linkedlifedata.com/resource/umls/id/C2345358
narrower: http://linkedlifedata.com/resource/umls/id/C2345366
narrower: http://linkedlifedata.com/resource/umls/id/C2345376
narrower: http://linkedlifedata.com/resource/umls/id/C2345378
narrower: http://linkedlifedata.com/resource/umls/id/C2345402
narrower: http://linkedlifedata.com/resource/umls/id/C2346032
narrower: http://linkedlifedata.com/resource/umls/id/C2346078
narrower: http://linkedlifedata.com/resource/umls/id/C2346120
narrower: http://linkedlifedata.com/resource/umls/id/C2346124
narrower: http://linkedlifedata.com/resource/umls/id/C2346128
narrower: http://linkedlifedata.com/resource/umls/id/C2346182
narrower: http://linkedlifedata.com/resource/umls/id/C2586945
narrower: http://linkedlifedata.com/resource/umls/id/C2587109
narrower: http://linkedlifedata.com/resource/umls/id/C2587130
narrower: http://linkedlifedata.com/resource/umls/id/C2587136
narrower: http://linkedlifedata.com/resource/umls/id/C2608649
narrower: http://linkedlifedata.com/resource/umls/id/C2608653
narrower: http://linkedlifedata.com/resource/umls/id/C0391004
narrower: http://linkedlifedata.com/resource/umls/id/C0391253
narrower: http://linkedlifedata.com/resource/umls/id/C0531138
narrower: http://linkedlifedata.com/resource/umls/id/C0251796
narrower: http://linkedlifedata.com/resource/umls/id/C0603338
narrower: http://linkedlifedata.com/resource/umls/id/C2364764
narrower: http://linkedlifedata.com/resource/umls/id/C0257665
narrower: http://linkedlifedata.com/resource/umls/id/C0061420
narrower: http://linkedlifedata.com/resource/umls/id/C1699869
narrower: http://linkedlifedata.com/resource/umls/id/C0299071
narrower: http://linkedlifedata.com/resource/umls/id/C0718321
narrower: http://linkedlifedata.com/resource/umls/id/C0049366
narrower: http://linkedlifedata.com/resource/umls/id/C0075156
narrower: http://linkedlifedata.com/resource/umls/id/C0078516
narrower: http://linkedlifedata.com/resource/umls/id/C0207603
narrower: http://linkedlifedata.com/resource/umls/id/C2344965
narrower: http://linkedlifedata.com/resource/umls/id/C2344992
narrower: http://linkedlifedata.com/resource/umls/id/C2345003
narrower: http://linkedlifedata.com/resource/umls/id/C2345010
narrower: http://linkedlifedata.com/resource/umls/id/C2345012
narrower: http://linkedlifedata.com/resource/umls/id/C2345047
narrower: http://linkedlifedata.com/resource/umls/id/C2346361
narrower: http://linkedlifedata.com/resource/umls/id/C2346366
narrower: http://linkedlifedata.com/resource/umls/id/C2346377
narrower: http://linkedlifedata.com/resource/umls/id/C2729519