http://linkedlifedata.com/resource/umls/id/C0011849
type: T047
type: Concept
has correlation: LIVB
has correlation: ANAT
has correlation: DISO
has correlation: GENE
has correlation: PHYS
has correlation: PHEN
has correlation: ACTI
has correlation: PROC
has correlation: OBJC
has correlation: DEVI
has correlation: CONC
has correlation: OCCU
has correlation: ORGA
has correlation: CHEM
definition: MSH: A heterogeneous group of disorders characterized by HYPERGLYCEMIA and GLUCOSE INTOLERANCE.,CSP: heterogeneous group of disorders that share glucose intolerance in common.,NCI: A disease in which the body does not control the amount of glucose (a type of sugar) in the blood and the kidneys make a large amount of urine. This disease occurs when the body does not make enough insulin or does not use it the way it should.,MEDLINEPLUS: Diabetes is a disease in which your blood glucose, or sugar, levels are too high. Glucose comes from the foods you eat. Insulin is a hormone that helps the glucose get into your cells to give them energy. With Type 1 diabetes, your body does not make insulin. With Type 2 diabetes, the more common type, your body does not make or use insulin well. Without enough insulin, the glucose stays in your blood. Over time, having too much glucose
in scheme: umls
broader: http://linkedlifedata.com/resource/umls/id/C0025517
broader: http://linkedlifedata.com/resource/umls/id/C0271633
broader: http://linkedlifedata.com/resource/umls/id/C0028715
narrower: http://linkedlifedata.com/resource/umls/id/C0597655
narrower: http://linkedlifedata.com/resource/umls/id/C0011854
narrower: http://linkedlifedata.com/resource/umls/id/C0011860
narrower: http://linkedlifedata.com/resource/umls/id/C0085207
narrower: http://linkedlifedata.com/resource/umls/id/C0011881
narrower: http://linkedlifedata.com/resource/umls/id/C1838655
narrower: http://linkedlifedata.com/resource/umls/id/C0011882
narrower: http://linkedlifedata.com/resource/umls/id/C0011875
narrower: http://linkedlifedata.com/resource/umls/id/C0011880
narrower: http://linkedlifedata.com/resource/umls/id/C0020456
narrower: http://linkedlifedata.com/resource/umls/id/C0362046
narrower: http://linkedlifedata.com/resource/umls/id/C0853897
narrower: http://linkedlifedata.com/resource/umls/id/C0235398
narrower: http://linkedlifedata.com/resource/umls/id/C0235399
narrower: http://linkedlifedata.com/resource/umls/id/C1809475
narrower: http://linkedlifedata.com/resource/umls/id/C2931765
narrower: http://linkedlifedata.com/resource/umls/id/C2931125
narrower: http://linkedlifedata.com/resource/umls/id/C0342286
narrower: http://linkedlifedata.com/resource/umls/id/C0920358
narrower: http://linkedlifedata.com/resource/umls/id/C0271646
narrower: http://linkedlifedata.com/resource/umls/id/C2930860
narrower: http://linkedlifedata.com/resource/umls/id/C2931057
narrower: http://linkedlifedata.com/resource/umls/id/C2931296
relation: R01046764
relation: R01046762
relation: R01046763
relation: R01046765
relation: R120261205
relation: R120261206
relation: R120261207
relation: R120261208
relation: R120261209
relation: R120261211
relation: R120261212
relation: R120261213
relation: R120261214
relation: R120261215
relation: R120261225
relation: R120261216
relation: R120261217
relation: R120261218
relation: R120261219
relation: R120261221
relation: R120261222
relation: R120261223
relation: R120261224
relation: R120261228
relation: R120261229
relation: R120261231
relation: R120261232
relation: R120261233
relation: R120261234
relation: R120261235
relation: R120261236
relation: R120261237
relation: R120261238
relation: R120261239
relation: R120261240
relation: R120261227