http://linkedlifedata.com/resource/umls/id/C0006675
type: T121
type: T123
type: T196
type: Concept
has correlation: LIVB
has correlation: ANAT
has correlation: DISO
has correlation: PHYS
has correlation: PHEN
has correlation: ACTI
has correlation: PROC
has correlation: OBJC
has correlation: DEVI
has correlation: CONC
has correlation: OCCU
has correlation: CHEM
definition: MSH: A basic element found in nearly all organized tissues. It is a member of the alkaline earth family of metals with the atomic symbol Ca, atomic number 20, and atomic weight 40. Calcium is the most abundant mineral in the body and combines with phosphorus to form calcium phosphate in the bones and teeth. It is essential for the normal functioning of nerves and muscles and plays a role in blood coagulation (as factor IV) and in many enzymatic processes.,CSP: basic element found in nearly all organized tissues; a member of the alkaline earth family of metals with the atomic symbol Ca, atomic number 20, and atomic weight 40; it is the most abundant mineral in the body and combines with phosphorus to form calcium phosphate in the bones and teeth; it is essential for the normal functioning of nerves and muscles and plays a role in blood coagulation and in many enzymatic processes.,NCI: A mineral needed for healthy teeth, bones, and other body tissues. It is the most common mineral in the body. A deposit of calc
in scheme: umls
broader: http://linkedlifedata.com/resource/umls/id/C0025555
broader: http://linkedlifedata.com/resource/umls/id/C0005789
narrower: http://linkedlifedata.com/resource/umls/id/C2828271
narrower: http://linkedlifedata.com/resource/umls/id/C2717412
narrower: http://linkedlifedata.com/resource/umls/id/C0622766
narrower: http://linkedlifedata.com/resource/umls/id/C0658192
relation: R01360736
relation: R54931327
relation: R55154080
relation: R112875171
relation: R120222441
relation: R120222442
relation: R120222445
relation: R120222446
relation: R120222447
relation: R120222449
relation: R120222450
relation: R120222451
relation: R120222453
relation: R120222454
relation: R120222455
relation: R120222457
relation: R120222458
relation: R120222459
relation: R120222460
relation: R120222461
relation: R120222462
relation: R120222463
relation: R120222464
relation: R120222465
relation: R120222466
relation: R120222467
relation: R120222452
relation: R120222443
relation: R120222456
relation: R120222448
relation: R71386731
relation: R71098263
relation: R128784933
relation: R128784932
relation: R128784934
relation: R128784935
relation: R128784936
relation: R128784937
relation: R131172195
relation: R131172196
relation: R28385405
relation: R28385406
relation: R28385408
relation: R28385409
relation: R71175180
relation: R71186196
relation: R71399013
relation: R70987530
relation: R70987531
relation: R71207030
relation: R71042150
relation: R71317551
relation: R70987540
relation: R71372721
relation: R70987541
relation: R71042151