http://linkedlifedata.com/resource/umls/id/C0004936
type: T048
type: Concept
has correlation: LIVB
has correlation: ANAT
has correlation: DISO
has correlation: GENE
has correlation: PHYS
has correlation: PHEN
has correlation: ACTI
has correlation: PROC
has correlation: CONC
has correlation: OCCU
definition: MSH: Psychiatric illness or diseases manifested by breakdowns in the adaptational process expressed primarily as abnormalities of thought, feeling, and behavior producing either distress or impairment of function.,CSP: any of various conditions characterized by impairment of an individual's normal cognitive, emotional, or behavioral functioning, and caused by social, psychological, biochemical, genetic, or other factors, such as infection or head trauma; note behavior disorders are a subset of mental disorder.,NCI: Any deviation from the normal structure or function of the brain and a psychiatric condition, that results in an impairment of an individual's normal cognitive, emotional, or behavioral functioning, and is caused by physiological or psychosocial factors. (NCI),MEDLINEPLUS: Mental disorders include a wide range of problems, including Anxiety disorders, including <a href='http://www.nlm.nih.gov/medlineplus/panicdisorder.html'
in scheme: umls
broader: http://linkedlifedata.com/resource/umls/id/C0556006
narrower: http://linkedlifedata.com/resource/umls/id/C0023186
narrower: http://linkedlifedata.com/resource/umls/id/C0025362
narrower: http://linkedlifedata.com/resource/umls/id/C0278061
narrower: http://linkedlifedata.com/resource/umls/id/C0004352
narrower: http://linkedlifedata.com/resource/umls/id/C0027932
narrower: http://linkedlifedata.com/resource/umls/id/C0004930
narrower: http://linkedlifedata.com/resource/umls/id/C0013146
narrower: http://linkedlifedata.com/resource/umls/id/C0013170
narrower: http://linkedlifedata.com/resource/umls/id/C1510472
narrower: http://linkedlifedata.com/resource/umls/id/C0038587
narrower: http://linkedlifedata.com/resource/umls/id/C0497327
narrower: http://linkedlifedata.com/resource/umls/id/C0221074
narrower: http://linkedlifedata.com/resource/umls/id/C0233660
narrower: http://linkedlifedata.com/resource/umls/id/C0033931
narrower: http://linkedlifedata.com/resource/umls/id/C0001807
narrower: http://linkedlifedata.com/resource/umls/id/C0009676
narrower: http://linkedlifedata.com/resource/umls/id/C0011253
narrower: http://linkedlifedata.com/resource/umls/id/C0018524
narrower: http://linkedlifedata.com/resource/umls/id/C0033975
narrower: http://linkedlifedata.com/resource/umls/id/C0085633
narrower: http://linkedlifedata.com/resource/umls/id/C0233794
narrower: http://linkedlifedata.com/resource/umls/id/C0235909
narrower: http://linkedlifedata.com/resource/umls/id/C0917816
narrower: http://linkedlifedata.com/resource/umls/id/C0001723
narrower: http://linkedlifedata.com/resource/umls/id/C0002622
narrower: http://linkedlifedata.com/resource/umls/id/C0003125
narrower: http://linkedlifedata.com/resource/umls/id/C0003469
narrower: http://linkedlifedata.com/resource/umls/id/C0005586
narrower: http://linkedlifedata.com/resource/umls/id/C0005887
narrower: http://linkedlifedata.com/resource/umls/id/C0006370
narrower: http://linkedlifedata.com/resource/umls/id/C0007370
narrower: http://linkedlifedata.com/resource/umls/id/C0007398
narrower: http://linkedlifedata.com/resource/umls/id/C0009241
narrower: http://linkedlifedata.com/resource/umls/id/C0009946
narrower: http://linkedlifedata.com/resource/umls/id/C0011206
narrower: http://linkedlifedata.com/resource/umls/id/C0011551
narrower: http://linkedlifedata.com/resource/umls/id/C0011570
narrower: http://linkedlifedata.com/resource/umls/id/C0012746
narrower: http://linkedlifedata.com/resource/umls/id/C0020505
narrower: http://linkedlifedata.com/resource/umls/id/C0020604
narrower: http://linkedlifedata.com/resource/umls/id/C0020701
narrower: http://linkedlifedata.com/resource/umls/id/C0027804
narrower: http://linkedlifedata.com/resource/umls/id/C0027821
narrower: http://linkedlifedata.com/resource/umls/id/C0031212
narrower: http://linkedlifedata.com/resource/umls/id/C0033922
narrower: http://linkedlifedata.com/resource/umls/id/C0349231
narrower: http://linkedlifedata.com/resource/umls/id/C0525045
narrower: http://linkedlifedata.com/resource/umls/id/C1456784
narrower: http://linkedlifedata.com/resource/umls/id/C0020903
narrower: http://linkedlifedata.com/resource/umls/id/C0028084
narrower: http://linkedlifedata.com/resource/umls/id/C0038663
narrower: http://linkedlifedata.com/resource/umls/id/C0151772
narrower: http://linkedlifedata.com/resource/umls/id/C0151836
narrower: http://linkedlifedata.com/resource/umls/id/C0151898
narrower: http://linkedlifedata.com/resource/umls/id/C0234458
narrower: http://linkedlifedata.com/resource/umls/id/C0235852
narrower: http://linkedlifedata.com/resource/umls/id/C0270458
narrower: http://linkedlifedata.com/resource/umls/id/C0424410
narrower: http://linkedlifedata.com/resource/umls/id/C1457883
narrower: http://linkedlifedata.com/resource/umls/id/C0235168
narrower: http://linkedlifedata.com/resource/umls/id/C0700613
narrower: http://linkedlifedata.com/resource/umls/id/C1279420
narrower: http://linkedlifedata.com/resource/umls/id/C0456820
narrower: http://linkedlifedata.com/resource/umls/id/C0338831
narrower: http://linkedlifedata.com/resource/umls/id/C0270330